BDBM249231 US9458135, 19
SMILES CN1C(=O)CCc2cc(c(F)cc12)-c1cncc(COc2ncccc2F)c1
InChI Key InChIKey=FTOABUIBYNWPLJ-UHFFFAOYSA-N
Data  2 EC50
  Tab Delimited (TSV)   2D SDfile   Computed 3D by Vconf -m prep SDfile
Find this compound or compounds like it in BindingDB:
Activity Spreadsheet -- Enzyme Inhibition Constant Data from BindingDB
Found 2 hits for monomerid = 249231
TargetCytochrome P450 11B1, mitochondrial(Homo sapiens (Human))
Hoffmann-La Roche
US Patent
LigandPNGBDBM249231(US9458135, 19)
Affinity DataEC50:  997nM. Assay description: Herein we identified the use of the G-402 cell line as a host cell to ectopically express (transiently or stably) enzymes of the CYP11 family. Specif...
Ligand InfoPC cidPC sid
In DepthDetails US Patent
TargetCytochrome P450 11B2, mitochondrial(Homo sapiens (Human))
Hoffmann-La Roche
US Patent
LigandPNGBDBM249231(US9458135, 19)
Affinity DataEC50:  14.1nM. Assay description: Herein we identified the use of the G-402 cell line as a host cell to ectopically express (transiently or stably) enzymes of the CYP11 family. Specif...
Ligand InfoPC cidPC sid
In DepthDetails US Patent