BDBM258442 US9512082, 7
SMILES COc1ccc(CNC(=O)Nc2ccc3[nH]cnc3c2)cc1OC
InChI Key InChIKey=BZEJGWYFKLLLCW-UHFFFAOYSA-N
Data  1 KI  1 IC50
  Tab Delimited (TSV)   2D SDfile   Computed 3D by Vconf -m prep SDfile
Find this compound or compounds like it in BindingDB:
Activity Spreadsheet -- Enzyme Inhibition Constant Data from BindingDB
Found 1 hit for monomerid = 258442
TargetGlutaminyl-peptide cyclotransferase(Homo sapiens (Human))
Probiodrug
US Patent
LigandPNGBDBM258442(US9512082, 7)
Affinity DataKi:  171nM ΔG°:  -9.38kcal/mole IC50:  1.67E+3nMpH: 8.0 T: 2°C. Assay description: For inhibitor testing, the sample composition was the same as described below, except of the putative inhibitory compound added. For a rapid test of ...
Ligand InfoPC cidPC sid
In DepthDetails US Patent