BDBM26286 N-(2,3-difluorophenyl)-2-{3-[(7-{3-[4-(2-hydroxyethyl)piperazin-1-yl]propoxy}-6-methoxyquinazolin-4-yl)amino]-1H-pyrazol-5-yl}acetamide::pyrazoloquinazoline deriv., 20
SMILES COc1cc2c(Nc3cc(CC(=O)Nc4cccc(F)c4F)n[nH]3)ncnc2cc1OCCCN1CCN(CCO)CC1
InChI Key InChIKey=LQQZIJDSGYXEEJ-UHFFFAOYSA-N
Data  2 KI
  Tab Delimited (TSV)   2D SDfile   Computed 3D by Vconf -m prep SDfile
Find this compound or compounds like it in BindingDB:
Activity Spreadsheet -- Enzyme Inhibition Constant Data from BindingDB
Found 2 hits for monomerid = 26286
TargetAurora kinase B(Homo sapiens (Human))
Astrazeneca
LigandPNGBDBM26286(N-(2,3-difluorophenyl)-2-{3-[(7-{3-[4-(2-hydroxyet...)
Affinity DataKi: <1nM ΔG°: <-12.1kcal/molepH: 7.5 T: 2°C. Assay description: In vitro kinase assay using recombinant Aurora B bound to INCENP was incubated at room temperature with substrate, and test compounds in the presence...
In DepthDetails ArticlePubMed
TargetAurora kinase A(Homo sapiens (Human))
Astrazeneca
LigandPNGBDBM26286(N-(2,3-difluorophenyl)-2-{3-[(7-{3-[4-(2-hydroxyet...)
Affinity DataKi:  55nM ΔG°:  -9.90kcal/moleT: 2°C. Assay description: In vitro kinase assay using recombinant Aurora A purified from Sf9 cells was incubated at room temperature with substrate, and test compounds in the ...
In DepthDetails ArticlePubMed