BDBM264250 2-((4-(4-Acetylpiperazin-1-yl)phenyl)amino)-6-(2,6-dichlorophenyl)pyrido[4,3-d]pyrimidin-5(6H)-one::US9714244, 5
SMILES CC(=O)N1CCN(CC1)c1ccc(Nc2ncc3c(ccn(-c4c(Cl)cccc4Cl)c3=O)n2)cc1
InChI Key InChIKey=CBPQQJCRCIVSGY-UHFFFAOYSA-N
Data  1 IC50
  Tab Delimited (TSV)   2D SDfile   Computed 3D by Vconf -m prep SDfile
Find this compound or compounds like it in BindingDB:
Activity Spreadsheet -- Enzyme Inhibition Constant Data from BindingDB
Found 1 hit for monomerid = 264250
TargetWee1-like protein kinase(Homo sapiens (Human))
Almac Discovery
US Patent
LigandPNGBDBM264250(2-((4-(4-Acetylpiperazin-1-yl)phenyl)amino)-6-(2,6...)
Affinity DataIC50:  105nMT: 2°C. Assay description: In the measurement of Wee-1 activity, a commercial peptide Poly(Lys Tyr(4:1)) hydrobromide was purchased from Sigma Aldrich and used as the substrate...
Ligand InfoPC cidPC sid
In DepthDetails US Patent