BDBM2657 (Phenylindolyl)maleimide deriv. 79::3-(3,5-dichlorophenyl)-4-(1-methyl-1H-indol-3-yl)-2,5-dihydro-1H-pyrrole-2,5-dione
SMILES Cn1cc(C2=C(C(=O)NC2=O)c2cc(Cl)cc(Cl)c2)c2ccccc12
InChI Key InChIKey=UVTLOYATPTULIH-UHFFFAOYSA-N
Data  2 IC50
  Tab Delimited (TSV)   2D SDfile   Computed 3D by Vconf -m prep SDfile
Find this compound or compounds like it in BindingDB:
Activity Spreadsheet -- Enzyme Inhibition Constant Data from BindingDB
Found 2 hits for monomerid = 2657
TargetcAMP-dependent protein kinase catalytic subunit alpha(Bos taurus (bovine))
Roche Products
LigandPNGBDBM2657((Phenylindolyl)maleimide deriv. 79 | 3-(3,5-dichlo...)
Affinity DataIC50: >1.00E+5nM. Assay description: The activity of PKA, activated by cAMP, is measured by its ability to transfer phosphate from [gamma-32P]ATP to histone.
In DepthDetails ArticlePubMed
TargetProtein kinase C beta type(Rattus norvegicus (rat))
Roche Products
LigandPNGBDBM2657((Phenylindolyl)maleimide deriv. 79 | 3-(3,5-dichlo...)
Affinity DataIC50:  7.60E+3nM. Assay description: The activity of PKC, activated by phosphatidylerine and Ca2+, is measured by its ability to transfer phosphate from [gamma-32P]ATP to lysine-rich his...
In DepthDetails ArticlePubMed