BDBM2676 3,4-bis(1H-indol-3-yl)pyrrolidine-2,5-dione::Bisindolyl deriv. 6
SMILES O=C1NC(=O)C(C1c1c[nH]c2ccccc12)c1c[nH]c2ccccc12
InChI Key InChIKey=QBMMMCZNMCDPBJ-UHFFFAOYSA-N
Data  1 IC50
  Tab Delimited (TSV)   2D SDfile   Computed 3D by Vconf -m prep SDfile
Find this compound or compounds like it in BindingDB:
Activity Spreadsheet -- Enzyme Inhibition Constant Data from BindingDB
Found 1 hit for monomerid = 2676
TargetcAMP-dependent protein kinase catalytic subunit alpha(Bos taurus (bovine))
Laboratoires Glaxo
LigandPNGBDBM2676(3,4-bis(1H-indol-3-yl)pyrrolidine-2,5-dione | Bisi...)
Affinity DataIC50: >1.00E+4nMpH: 7.4 T: 2°C. Assay description: IC50 is the inhibitor concentration which inhibits 50% of kinase activity that catalyzes the transfer of the terminal phosphate from [gamma-32P] labe...
In DepthDetails PubMed