BDBM270535 (S)-3-(((2-methyl-5-(o-tolyl)iso-indolin-1-yl)methyl)amino) isonicotinic acid::US10059687, Example 21B::US11001568, Example 21B
SMILES CN1Cc2cc(ccc2[C@H]1CNc1cnccc1C(O)=O)-c1ccccc1C
InChI Key InChIKey=VWCIJAQHQIPQCH-JOCHJYFZSA-N
Data  6 IC50
  Tab Delimited (TSV)   2D SDfile   Computed 3D by Vconf -m prep SDfile
Find this compound or compounds like it in BindingDB:
Activity Spreadsheet -- Enzyme Inhibition Constant Data from BindingDB
Found 6 hits for monomerid = 270535
TargetLysine-specific demethylase 4C(Homo sapiens (Human))
Celgene Quanticel Research
US Patent
LigandPNGBDBM270535((S)-3-(((2-methyl-5-(o-tolyl)iso-indolin-1-yl)meth...)
Affinity DataIC50:  550nM. Assay description: The ability of test compounds to inhibit the activity of JMJD2C was determined in 384-well plate format under the following reaction conditions: 0.3 ...
Ligand InfoPC cidPC sid
In DepthDetails US Patent
TargetLysine-specific demethylase 6B(Homo sapiens (Human))
Celgene Quanticel Research
US Patent
LigandPNGBDBM270535((S)-3-(((2-methyl-5-(o-tolyl)iso-indolin-1-yl)meth...)
Affinity DataIC50:  5.50E+3nM. Assay description: The enzymatic assay of JMJD3 activity is based upon Time Resolved-Fluorescence Resonance Energy Transfer (TR-FRET) detection. The ability of test com...
Ligand InfoPC cidPC sid
In DepthDetails US Patent
TargetLysine-specific demethylase 5B(Homo sapiens (Human))
Celgene Quanticel Research
US Patent
LigandPNGBDBM270535((S)-3-(((2-methyl-5-(o-tolyl)iso-indolin-1-yl)meth...)
Affinity DataIC50: <100nM. Assay description: Jarid1b: The ability of test compounds to inhibit the activity of Jarid1B was determined in 384-well plate format under the following reaction condit...
Ligand InfoPC cidPC sid
In DepthDetails US Patent
TargetLysine-specific demethylase 4C(Homo sapiens (Human))
Celgene Quanticel Research
US Patent
LigandPNGBDBM270535((S)-3-(((2-methyl-5-(o-tolyl)iso-indolin-1-yl)meth...)
Affinity DataIC50:  550nM. Assay description: JMJD2C: The ability of test compounds to inhibit the activity of JMJD2C was determined in 384-well plate format under the following reaction conditio...
Ligand InfoPC cidPC sid
In DepthDetails US Patent
TargetLysine-specific demethylase 6B(Homo sapiens (Human))
Celgene Quanticel Research
US Patent
LigandPNGBDBM270535((S)-3-(((2-methyl-5-(o-tolyl)iso-indolin-1-yl)meth...)
Affinity DataIC50:  5.50E+3nM. Assay description: JMJD3: The enzymatic assay of JMJD3 activity is based upon Time Resolved-Fluorescence Resonance Energy Transfer (TR-FRET) detection. The ability of t...
Ligand InfoPC cidPC sid
In DepthDetails US Patent
TargetLysine-specific demethylase 5B(Homo sapiens (Human))
Celgene Quanticel Research
US Patent
LigandPNGBDBM270535((S)-3-(((2-methyl-5-(o-tolyl)iso-indolin-1-yl)meth...)
Affinity DataIC50: <100nM. Assay description: The ability of test compounds to inhibit the activity of Jarid1B was determined in 384-well plate format under the following reaction conditions: 0.8...
Ligand InfoPC cidPC sid
In DepthDetails US Patent