BDBM27077 N-[3-(1H-1,3-benzodiazol-2-yl)-1H-pyrazol-4-yl]acetamide::pyrazole-benzimidazole amide analogue, 6
SMILES CC(=O)Nc1c[nH]nc1-c1nc2ccccc2[nH]1
InChI Key InChIKey=LEFKZSWCBZBDLU-UHFFFAOYSA-N
Data  4 IC50
  Tab Delimited (TSV)   2D SDfile   Computed 3D by Vconf -m prep SDfile
Find this compound or compounds like it in BindingDB:
Activity Spreadsheet -- Enzyme Inhibition Constant Data from BindingDB
Found 4 hits for monomerid = 27077
TargetAurora kinase A(Homo sapiens (Human))
Astex
LigandPNGBDBM27077(N-[3-(1H-1,3-benzodiazol-2-yl)-1H-pyrazol-4-yl]ace...)
Affinity DataIC50:  70nMpH: 7.0 T: 2°C. Assay description: Assays for Aurora kinase was performed in a DELFIA format. Aurora enzyme was incubated with test compound and cross-tide substrate in the reaction bu...
In DepthDetails ArticlePubMed
TargetCyclin-A2/Cyclin-dependent kinase 2(Homo sapiens (Human))
Astex
LigandPNGBDBM27077(N-[3-(1H-1,3-benzodiazol-2-yl)-1H-pyrazol-4-yl]ace...)
Affinity DataIC50:  990nM. Assay description: CDK2/cyclinA activity was determined using a radiometric assay to measure the incorporation of gamma-phosphate from [gamma-33P]-ATP into histone H1. ...
In DepthDetails ArticlePubMed
LigandPNGBDBM27077(N-[3-(1H-1,3-benzodiazol-2-yl)-1H-pyrazol-4-yl]ace...)
Affinity DataIC50:  3.20E+3nM. Assay description: CDK1/cyclinB activity was determined using a radiometric assay to measure the incorporation of gamma-phosphate from [gamma-33P]-ATP into histone H1. ...
In DepthDetails ArticlePubMed
TargetAurora kinase B(Homo sapiens (Human))
Astex
LigandPNGBDBM27077(N-[3-(1H-1,3-benzodiazol-2-yl)-1H-pyrazol-4-yl]ace...)
Affinity DataIC50:  510nMpH: 8.5 T: 2°C. Assay description: Assays for Aurora kinase was performed in a DELFIA format. Aurora enzyme was incubated with test compound and cross-tide substrate in the reaction bu...
In DepthDetails ArticlePubMed