BDBM27112 2-(1-cyclopentylpyrrolidin-3-yl)-1H-1,3-benzodiazole-4-carboxamide::cyclic amine-containing benzimidazole carboxamide, 7c
SMILES NC(=O)c1cccc2nc([nH]c12)C1CCN(C1)C1CCCC1
InChI Key InChIKey=NMAVQCGGQINJLI-UHFFFAOYSA-N
Data  1 KI
  Tab Delimited (TSV)   2D SDfile   Computed 3D by Vconf -m prep SDfile
Find this compound or compounds like it in BindingDB:
Activity Spreadsheet -- Enzyme Inhibition Constant Data from BindingDB
Found 1 hit for monomerid = 27112
TargetPoly [ADP-ribose] polymerase 1(Homo sapiens (Human))
Abbott Laboratories
LigandPNGBDBM27112(2-(1-cyclopentylpyrrolidin-3-yl)-1H-1,3-benzodiazo...)
Affinity DataKi:  5nM ΔG°:  -11.2kcal/molepH: 8.0 T: 2°C. Assay description: PARP assays utilizing SPA bead-based detection were carried out in 96-well plates. After reaction was terminated, the reaction mixtures were transfer...
In DepthDetails ArticlePubMed