BDBM271421 4- (((3aR,5aR,5bR,7aR,9S, 11aR,11bR,13aS)-3a- ((S)-2-((3- Chlorobenzyl)(2- (dimethylamino)ethyl) amino)-1-hydroxyethyl)-1- isopropyl-5a,5b,8,8,11a- pentamethyl-2-oxo- 3,3a,4,5,5a,5b,6,7,7a,8,9, 10,11,11a,11b,12,13,13a- octadecahydro-2H- cyclopenta[a]chrysen-9- yl)oxy)-2,2-dimethyl-4- oxobutanoic acid::US10064873, Example 44
SMILES [H][C@]12CC[C@]3([H])[C@@]4(C)CC[C@H](OC(=O)CC(C)(C)C(O)=O)C(C)(C)[C@]4([H])CC[C@@]3(C)[C@]1(C)CC[C@]1(CC(=O)C(C(C)C)=C21)[C@H](O)CN(CCN(C)C)Cc1cccc(Cl)c1
InChI Key InChIKey=DSNMRZSQABDJDK-NWKALQLCSA-N
Data  2 EC50
  Tab Delimited (TSV)   2D SDfile   Computed 3D by Vconf -m prep SDfile
Find this compound or compounds like it in BindingDB:
Activity Spreadsheet -- Enzyme Inhibition Constant Data from BindingDB
Found 2 hits for monomerid = 271421
TargetEnvelope glycoprotein gp160 [V370A](Human immunodeficiency virus 1)
Glaxosmithkline
US Patent
LigandPNGBDBM271421(4- (((3aR,5aR,5bR,7aR,9S, 11aR,11bR,13aS)-3a- ((S)...)
Affinity DataEC50:  2.60nM. Assay description: Antiviral HIV activity and compound-induced cytotoxicity were measured in parallel by means of a propidium iodide based procedure in the human T-cell...
In DepthDetails US Patent
TargetEnvelope glycoprotein gp160(Human immunodeficiency virus type 1 (isolate BRU/L...)
Glaxosmithkline
US Patent
LigandPNGBDBM271421(4- (((3aR,5aR,5bR,7aR,9S, 11aR,11bR,13aS)-3a- ((S)...)
Affinity DataEC50:  1.80nM. Assay description: Antiviral HIV activity and compound-induced cytotoxicity were measured in parallel by means of a propidium iodide based procedure in the human T-cell...
In DepthDetails US Patent