BDBM274454 2-fluoro-N-(6-(4-(4-fluorophenyl)-1-(1- (2-morpholinoethyl)piperidin-4-yl)-1H- imidazol-5-yl)imidazo[1,2-b]pyridazin- 2-yl)isonicotinamide::US9556179, Compound 23
SMILES Fc1ccc(cc1)-c1ncn(C2CCN(CCN3CCOCC3)CC2)c1-c1ccc2nc(NC(=O)c3ccnc(F)c3)cn2n1
InChI Key InChIKey=DEGUNUMSIBFHDW-UHFFFAOYSA-N
Data  2 IC50
  Tab Delimited (TSV)   2D SDfile   Computed 3D by Vconf -m prep SDfile
Find this compound or compounds like it in BindingDB:
Activity Spreadsheet -- Enzyme Inhibition Constant Data from BindingDB
Found 2 hits for monomerid = 274454
TargetCasein kinase I isoform delta(Homo sapiens (Human))
Bristol-Myers Squibb
US Patent
LigandPNGBDBM274454(2-fluoro-N-(6-(4-(4-fluorophenyl)-1-(1- (2-morphol...)
Affinity DataIC50:  0.183nMpH: 7.4 T: 2°C. Assay description: The kinase assay was performed in V-bottom 384-well plates. The final assay volume was 30 μl prepared from 15 μl additions of enzyme, subst...
Ligand InfoPC cidPC sid
In DepthDetails US Patent
TargetCasein kinase I isoform epsilon(Homo sapiens (Human))
Bristol-Myers Squibb
US Patent
LigandPNGBDBM274454(2-fluoro-N-(6-(4-(4-fluorophenyl)-1-(1- (2-morphol...)
Affinity DataIC50:  0.675nMpH: 7.4 T: 2°C. Assay description: The kinase assay was performed in V-bottom 384-well plates. The final assay volume was 30 μl prepared from 15 μl additions of enzyme, subst...
Ligand InfoPC cidPC sid
In DepthDetails US Patent