BDBM27446 5-(5,6-dimethoxy-1H-1,3-benzodiazol-1-yl)-3-(oxolan-2-ylmethoxy)thiophene-2-carboxamide::benzimidazole-thiophene carboxamide, 4
SMILES COc1cc2ncn(-c3cc(OCC4CCCO4)c(s3)C(N)=O)c2cc1OC
InChI Key InChIKey=RNXPIGAWEIQILT-UHFFFAOYSA-N
Data  3 IC50
  Tab Delimited (TSV)   2D SDfile   Computed 3D by Vconf -m prep SDfile
Find this compound or compounds like it in BindingDB:
Activity Spreadsheet -- Enzyme Inhibition Constant Data from BindingDB
Found 3 hits for monomerid = 27446
LigandPNGBDBM27446(5-(5,6-dimethoxy-1H-1,3-benzodiazol-1-yl)-3-(oxola...)
Affinity DataIC50: >1.58E+4nMpH: 7.4 T: 2°C. Assay description: IKK kinase activity was assessed using a time-resolved fluorescence resonance energy transfer (TR-FRET) assay. The reaction was initiated by the addi...
In DepthDetails ArticlePubMed
TargetSerine/threonine-protein kinase PLK1(Homo sapiens (Human))
Gsk
LigandPNGBDBM27446(5-(5,6-dimethoxy-1H-1,3-benzodiazol-1-yl)-3-(oxola...)
Affinity DataIC50:  251nMpH: 7.2 T: 2°C. Assay description: The compound inhibitory activity was determined by incubation with purified PLK1 and biotinylated peptide substrate in the presence ATP/[gamma-33P]AT...
In DepthDetails ArticlePubMed
LigandPNGBDBM27446(5-(5,6-dimethoxy-1H-1,3-benzodiazol-1-yl)-3-(oxola...)
Affinity DataIC50: >1.58E+4nMpH: 7.4 T: 2°C. Assay description: IKK kinase activity was assessed using a time-resolved fluorescence resonance energy transfer (TR-FRET) assay. The reaction was initiated by the addi...
In DepthDetails ArticlePubMed