BDBM27451 5-(5,6-dimethoxy-1H-1,3-benzodiazol-1-yl)-3-[(1R)-1-[2-(trifluoromethyl)phenyl]ethoxy]thiophene-2-carbonitrile::benzimidazole-thiophene carbonitrile, 12d
SMILES COc1cc2ncn(-c3cc(O[C@H](C)c4ccccc4C(F)(F)F)c(s3)C#N)c2cc1OC
InChI Key InChIKey=ZBDAQPLOODCBHP-CYBMUJFWSA-N
Data  1 IC50
  Tab Delimited (TSV)   2D SDfile   Computed 3D by Vconf -m prep SDfile
Find this compound or compounds like it in BindingDB:
Activity Spreadsheet -- Enzyme Inhibition Constant Data from BindingDB
Found 1 hit for monomerid = 27451
LigandPNGBDBM27451(5-(5,6-dimethoxy-1H-1,3-benzodiazol-1-yl)-3-[(1R)-...)
Affinity DataIC50:  3.98E+3nMpH: 7.4 T: 2°C. Assay description: IKK kinase activity was assessed using a time-resolved fluorescence resonance energy transfer (TR-FRET) assay. The reaction was initiated by the addi...
In DepthDetails ArticlePubMed