BDBM275730 US10071086, Compound 590
SMILES Fc1ccccc1-c1cccc2[nH]c(nc12)-c1n[nH]c2ncc(cc12)-c1cccnc1
InChI Key InChIKey=GPKAEWZCGQQDNN-UHFFFAOYSA-N
Data  1 IC50
  Tab Delimited (TSV)   2D SDfile   Computed 3D by Vconf -m prep SDfile
Find this compound or compounds like it in BindingDB:
Activity Spreadsheet -- Enzyme Inhibition Constant Data from BindingDB
Found 1 hit for monomerid = 275730
TargetAdenomatous polyposis coli protein(Homo sapiens (Human))
Samumed
US Patent
LigandPNGBDBM275730(US10071086, Compound 590)
Affinity DataIC50:  20nM. Assay description: Reporter cell lines can be generated by stably transducing cells of cancer cell lines (e.g., colon cancer) with a lentiviral construct that include a...
Ligand InfoPC cidPC sid
In DepthDetails US Patent