BDBM27714 5-fluoro-1-[4-(4-phenyl-1,2,3,6-tetrahydropyridin-1-yl)butyl]-1,2,3,4-tetrahydroquinazoline-2,4-dione::CHEMBL361054::quinazolidinone analogue, 2b
SMILES Fc1cccc2n(CCCCN3CCC(=CC3)c3ccccc3)c(=O)[nH]c(=O)c12
InChI Key InChIKey=PNPFDRCIGCUCMN-UHFFFAOYSA-N
Data  3 IC50
PDB links: 1 PDB ID matches this monomer.
  Tab Delimited (TSV)   2D SDfile   Computed 3D by Vconf -m prep SDfile
Find this compound or compounds like it in BindingDB:
Activity Spreadsheet -- Enzyme Inhibition Constant Data from BindingDB
Found 3 hits for monomerid = 27714
TargetPoly [ADP-ribose] polymerase 1(Homo sapiens (Human))
Fujisawa Pharmaceutical
LigandPNGBDBM27714(5-fluoro-1-[4-(4-phenyl-1,2,3,6-tetrahydropyridin-...)
Affinity DataIC50:  60nMpH: 8.0 T: 2°C. Assay description: To assess the inhibitory activity of novel inhibitors, the PARP enzyme assay was carried out in reaction mixture consisting of activated salmon teste...
TargetPoly [ADP-ribose] polymerase 1(Homo sapiens (Human))
Fujisawa Pharmaceutical
LigandPNGBDBM27714(5-fluoro-1-[4-(4-phenyl-1,2,3,6-tetrahydropyridin-...)
Affinity DataIC50:  60nM. Assay description: In vitro inhibitory concentration against human recombinant Poly (ADP-ribose) polymerase 1
TargetPoly [ADP-ribose] polymerase 2(Mus musculus (Mouse))
Fujisawa Pharmaceutical
LigandPNGBDBM27714(5-fluoro-1-[4-(4-phenyl-1,2,3,6-tetrahydropyridin-...)
Affinity DataIC50:  83nMT: 2°C. Assay description: To assess the inhibitory activity of novel inhibitors, the PARP enzyme assay was carried out in reaction mixture consisting of activated salmon teste...
In DepthDetails ArticlePubMed