BDBM280349 (S)-4-(2-(5-chloro-2-fluorophenyl)-5-(dimethylamino)pyridin-4-ylamino)-N-(2-hydroxypropyl)nicotinamide::US10030004, Compound 16a::US10501436, Compound 16a::US11053216, Compound 16a::US11702401, Compound 16a
SMILES C[C@H](O)CNC(=O)c1cnccc1Nc1cc(ncc1N(C)C)-c1cc(Cl)ccc1F
InChI Key InChIKey=SRVVCPDKVNJPAH-ZDUSSCGKSA-N
Data  24 IC50
  Tab Delimited (TSV)   2D SDfile   Computed 3D by Vconf -m prep SDfile
Find this compound or compounds like it in BindingDB:
Activity Spreadsheet -- Enzyme Inhibition Constant Data from BindingDB
Found 24 hits for monomerid = 280349
TargetSerine/threonine-protein kinase receptor R3(Homo sapiens (Human))
Medivation Technologies
US Patent
LigandPNGBDBM280349((S)-4-(2-(5-chloro-2-fluorophenyl)-5-(dimethylamin...)
Affinity DataIC50:  7.30E+3nM. Assay description: Compound of the invention were screened in an in vitro kinase assay against several members of the TGFβ family of Ser/Thr kinases. The kinases t...
Ligand InfoPC cidPC sid
In DepthDetails US Patent
TargetBone morphogenetic protein receptor type-1B(Homo sapiens (Human))
Medivation Technologies
US Patent
LigandPNGBDBM280349((S)-4-(2-(5-chloro-2-fluorophenyl)-5-(dimethylamin...)
Affinity DataIC50: >1.00E+6nM. Assay description: Compound of the invention were screened in an in vitro kinase assay against several members of the TGFβ3 family of Ser/Thr kinases. The kinases ...
Ligand InfoPC cidPC sid
In DepthDetails US Patent
TargetBone morphogenetic protein receptor type-1A(Homo sapiens (Human))
Medivation Technologies
US Patent
LigandPNGBDBM280349((S)-4-(2-(5-chloro-2-fluorophenyl)-5-(dimethylamin...)
Affinity DataIC50: >1.00E+6nM. Assay description: Compound of the invention were screened in an in vitro kinase assay against several members of the TGFβ family of Ser/Thr kinases. The kinases t...
Ligand InfoPC cidPC sid
In DepthDetails US Patent
TargetActivin receptor type-1B(Homo sapiens (Human))
Medivation Technologies
US Patent
LigandPNGBDBM280349((S)-4-(2-(5-chloro-2-fluorophenyl)-5-(dimethylamin...)
Affinity DataIC50:  114nM. Assay description: Compound of the invention were screened in an in vitro kinase assay against several members of the TGFβ family of Ser/Thr kinases. The kinases t...
Ligand InfoPC cidPC sid
In DepthDetails US Patent
TargetTGF-beta receptor type-1(Homo sapiens (Human))
Medivation Technologies
US Patent
LigandPNGBDBM280349((S)-4-(2-(5-chloro-2-fluorophenyl)-5-(dimethylamin...)
Affinity DataIC50:  42.2nM. Assay description: Compound of the invention were screened in an in vitro kinase assay against several members of the TGFβ family of Ser/Thr kinases. The kinases t...
Ligand InfoPC cidPC sid
In DepthDetails US Patent
TargetBone morphogenetic protein receptor type-1B(Mus musculus (Mouse))
Medivation Technologies
US Patent
LigandPNGBDBM280349((S)-4-(2-(5-chloro-2-fluorophenyl)-5-(dimethylamin...)
Affinity DataIC50: >1.00E+6nM. Assay description: Compound of the invention were screened in an in vitro kinase assay against several members of the TGFβ family of Ser/Thr kinases. The kinases t...
Ligand InfoPC cidPC sid
In DepthDetails US Patent
TargetSerine/threonine-protein kinase receptor R3(Homo sapiens (Human))
Medivation Technologies
US Patent
LigandPNGBDBM280349((S)-4-(2-(5-chloro-2-fluorophenyl)-5-(dimethylamin...)
Affinity DataIC50:  7.30E+3nM. Assay description: Compound of the invention were screened in an in vitro kinase assay against several members of the TGFβ family of Ser/Thr kinases. The kinases t...
Ligand InfoPC cidPC sid
In DepthDetails US Patent
TargetActivin receptor type-1(Homo sapiens (Human))
Medivation Technologies
US Patent
LigandPNGBDBM280349((S)-4-(2-(5-chloro-2-fluorophenyl)-5-(dimethylamin...)
Affinity DataIC50: >1.00E+6nM. Assay description: Compound of the invention were screened in an in vitro kinase assay against several members of the TGFβ family of Ser/Thr kinases. The kinases t...
Ligand InfoPC cidPC sid
In DepthDetails US Patent
TargetBone morphogenetic protein receptor type-1A(Homo sapiens (Human))
Medivation Technologies
US Patent
LigandPNGBDBM280349((S)-4-(2-(5-chloro-2-fluorophenyl)-5-(dimethylamin...)
Affinity DataIC50: >1.00E+6nM. Assay description: Compound of the invention were screened in an in vitro kinase assay against several members of the TGFβ family of Ser/Thr kinases. The kinases t...
Ligand InfoPC cidPC sid
In DepthDetails US Patent
TargetActivin receptor type-1B(Homo sapiens (Human))
Medivation Technologies
US Patent
LigandPNGBDBM280349((S)-4-(2-(5-chloro-2-fluorophenyl)-5-(dimethylamin...)
Affinity DataIC50:  114nM. Assay description: Compound of the invention were screened in an in vitro kinase assay against several members of the TGFβ family of Ser/Thr kinases. The kinases t...
Ligand InfoPC cidPC sid
In DepthDetails US Patent
TargetTGF-beta receptor type-1(Homo sapiens (Human))
Medivation Technologies
US Patent
LigandPNGBDBM280349((S)-4-(2-(5-chloro-2-fluorophenyl)-5-(dimethylamin...)
Affinity DataIC50:  42.2nM. Assay description: Compound of the invention were screened in an in vitro kinase assay against several members of the TGFβ family of Ser/Thr kinases. The kinases t...
Ligand InfoPC cidPC sid
In DepthDetails US Patent
TargetBone morphogenetic protein receptor type-1B(Homo sapiens (Human))
Medivation Technologies
US Patent
LigandPNGBDBM280349((S)-4-(2-(5-chloro-2-fluorophenyl)-5-(dimethylamin...)
Affinity DataIC50: >1.00E+6nM. Assay description: Compound of the invention were screened in an in vitro kinase assay against several members of the TGFβ family of Ser/Thr kinases. The kinases t...
Ligand InfoPC cidPC sid
In DepthDetails US Patent
TargetSerine/threonine-protein kinase receptor R3(Homo sapiens (Human))
Medivation Technologies
US Patent
LigandPNGBDBM280349((S)-4-(2-(5-chloro-2-fluorophenyl)-5-(dimethylamin...)
Affinity DataIC50:  7.30E+3nM. Assay description: Compound of the invention were screened in an in vitro kinase assay against several members of the TGFβ family of Ser/Thr kinases. The kinases t...
Ligand InfoPC cidPC sid
In DepthDetails US Patent
TargetActivin receptor type-1(Homo sapiens (Human))
Medivation Technologies
US Patent
LigandPNGBDBM280349((S)-4-(2-(5-chloro-2-fluorophenyl)-5-(dimethylamin...)
Affinity DataIC50: >1.00E+6nM
Ligand InfoPC cidPC sid
In DepthDetails US Patent
TargetBone morphogenetic protein receptor type-1A(Homo sapiens (Human))
Medivation Technologies
US Patent
LigandPNGBDBM280349((S)-4-(2-(5-chloro-2-fluorophenyl)-5-(dimethylamin...)
Affinity DataIC50: >1.00E+6nM
Ligand InfoPC cidPC sid
In DepthDetails US Patent
TargetActivin receptor type-1B(Homo sapiens (Human))
Medivation Technologies
US Patent
LigandPNGBDBM280349((S)-4-(2-(5-chloro-2-fluorophenyl)-5-(dimethylamin...)
Affinity DataIC50:  114nM
Ligand InfoPC cidPC sid
In DepthDetails US Patent
TargetTGF-beta receptor type-1(Homo sapiens (Human))
Medivation Technologies
US Patent
LigandPNGBDBM280349((S)-4-(2-(5-chloro-2-fluorophenyl)-5-(dimethylamin...)
Affinity DataIC50:  42.2nM
Ligand InfoPC cidPC sid
In DepthDetails US Patent
TargetBone morphogenetic protein 10(Homo sapiens (Human))
Medivation Technologies
US Patent
LigandPNGBDBM280349((S)-4-(2-(5-chloro-2-fluorophenyl)-5-(dimethylamin...)
Affinity DataIC50: >1.00E+6nM
Ligand InfoPC cidPC sid
In DepthDetails US Patent
TargetSerine/threonine-protein kinase receptor R3(Homo sapiens (Human))
Medivation Technologies
US Patent
LigandPNGBDBM280349((S)-4-(2-(5-chloro-2-fluorophenyl)-5-(dimethylamin...)
Affinity DataIC50:  7.30E+3nM. Assay description: Compound of the invention were screened in an in vitro kinase assay against several members of the TGFβ3 family of Ser/Thr kinases. The kinases ...
Ligand InfoPC cidPC sid
In DepthDetails US Patent
TargetActivin receptor type-1(Homo sapiens (Human))
Medivation Technologies
US Patent
LigandPNGBDBM280349((S)-4-(2-(5-chloro-2-fluorophenyl)-5-(dimethylamin...)
Affinity DataIC50: >1.00E+6nM. Assay description: Compound of the invention were screened in an in vitro kinase assay against several members of the TGFβ3 family of Ser/Thr kinases. The kinases ...
Ligand InfoPC cidPC sid
In DepthDetails US Patent
TargetBone morphogenetic protein receptor type-1A(Homo sapiens (Human))
Medivation Technologies
US Patent
LigandPNGBDBM280349((S)-4-(2-(5-chloro-2-fluorophenyl)-5-(dimethylamin...)
Affinity DataIC50: >1.00E+6nM. Assay description: Compound of the invention were screened in an in vitro kinase assay against several members of the TGFβ3 family of Ser/Thr kinases. The kinases ...
Ligand InfoPC cidPC sid
In DepthDetails US Patent
TargetActivin receptor type-1B(Homo sapiens (Human))
Medivation Technologies
US Patent
LigandPNGBDBM280349((S)-4-(2-(5-chloro-2-fluorophenyl)-5-(dimethylamin...)
Affinity DataIC50:  114nM. Assay description: Compound of the invention were screened in an in vitro kinase assay against several members of the TGFβ3 family of Ser/Thr kinases. The kinases ...
Ligand InfoPC cidPC sid
In DepthDetails US Patent
TargetTGF-beta receptor type-1(Homo sapiens (Human))
Medivation Technologies
US Patent
LigandPNGBDBM280349((S)-4-(2-(5-chloro-2-fluorophenyl)-5-(dimethylamin...)
Affinity DataIC50:  42.2nM. Assay description: Compound of the invention were screened in an in vitro kinase assay against several members of the TGFβ3 family of Ser/Thr kinases. The kinases ...
Ligand InfoPC cidPC sid
In DepthDetails US Patent
TargetActivin receptor type-1(Homo sapiens (Human))
Medivation Technologies
US Patent
LigandPNGBDBM280349((S)-4-(2-(5-chloro-2-fluorophenyl)-5-(dimethylamin...)
Affinity DataIC50: >1.00E+6nM. Assay description: Compound of the invention were screened in an in vitro kinase assay against several members of the TGFβ family of Ser/Thr kinases. The kinases t...
Ligand InfoPC cidPC sid
In DepthDetails US Patent