BDBM281037 4-[(11S,14S,17S)-14-(4-Amino-butyl)-11-(3-amino-propyl)-25-chloro-17-(1H-indol-3-ylmethyl)-16-methyl-12,15,18-trioxo-2-thia-4,10,13,16,19-pentaaza-tricyclo[19.4.0.0*3,8*]pentacosa-1(25),3(8),4,6,21,23-hexaen-22-yl]-N-(2-hydroxy-ethyl)-benzenesulfonamide::US10030047, Example 246
SMILES CN1[C@@H](Cc2c[nH]c3ccccc23)C(=O)NCc2c(Sc3ncccc3CN[C@@H](CCCN)C(=O)N[C@@H](CCCCN)C1=O)c(Cl)ccc2-c1ccc(cc1)S(=O)(=O)NCCO
InChI Key
Data  1 IC50
  Tab Delimited (TSV)   2D SDfile   Computed 3D by Vconf -m prep SDfile
Find this compound or compounds like it in BindingDB:
Activity Spreadsheet -- Enzyme Inhibition Constant Data from BindingDB
Found 1 hit for monomerid = 281037
TargetAdhesin Ata autotransporter(Acinetobacter baumannii (strain ATCC 17978 / CIP 5...)
Hoffmann-La Roche
US Patent
LigandPNGBDBM281037(4-[(11S,14S,17S)-14-(4-Amino-butyl)-11-(3-amino-pr...)
Affinity DataIC50: <100nM. Assay description: The in vitro antimicrobial activity of the compounds was alternatively determined according to the following procedure:The assay used a 10-points Iso...
Ligand InfoPC cidPC sid
In DepthDetails US Patent