BDBM281830 2-({[5-(4-aminoquinazolin-6- yl)thiophen-2-yl]methyl}amino)- N-(5-fluoro-2-methylbenzyl) pyridine-3-carboxamide (TFA salt)::US10030016, Example 3.18
SMILES Cc1ccc(F)cc1CNC(=O)c1cccnc1NCc1ccc(s1)-c1ccc2ncnc(N)c2c1
InChI Key InChIKey=BSPZVRFAPJDHFV-UHFFFAOYSA-N
Data  1 IC50
  Tab Delimited (TSV)   2D SDfile   Computed 3D by Vconf -m prep SDfile
Find this compound or compounds like it in BindingDB:
Activity Spreadsheet -- Enzyme Inhibition Constant Data from BindingDB
Found 1 hit for monomerid = 281830
Target3-phosphoinositide-dependent protein kinase 1 [51-359](Homo sapiens (Human))
Sunesis Pharmaceuticals
US Patent
LigandPNGBDBM281830(2-({[5-(4-aminoquinazolin-6- yl)thiophen-2-yl]meth...)
Affinity DataIC50:  550nM. Assay description: PDK1 (amino acids 51-359) and AKT2 (amino acids 140-467 fused to PIFtide, amino acids EEQEMFRDFDYIADW) were expressed as N-terminally tagged GST fusi...
Ligand InfoPC cidPC sid
In DepthDetails US Patent