BDBM28326 (1R,2S)-1-{[4-(4-chlorophenyl)benzene][2-(2-oxo-1,3-oxazinan-3-yl)ethyl]sulfonamido}-2-phenylcyclopropane-1-carboxylic acid::sulfonylamino-alkanecarboxylate, 40
SMILES OC(=O)[C@]1(C[C@H]1c1ccccc1)N(CCN1CCCOC1=O)S(=O)(=O)c1ccc(cc1)-c1ccc(Cl)cc1
InChI Key InChIKey=MJBZNVGBLSSPEY-LBNVMWSVSA-N
Data  1 IC50
  Tab Delimited (TSV)   2D SDfile   Computed 3D by Vconf -m prep SDfile
Find this compound or compounds like it in BindingDB:
Activity Spreadsheet -- Enzyme Inhibition Constant Data from BindingDB
Found 1 hit for monomerid = 28326
LigandPNGBDBM28326((1R,2S)-1-{[4-(4-chlorophenyl)benzene][2-(2-oxo-1,...)
Affinity DataIC50:  180nMpH: 7.5 T: 2°C. Assay description: The ADAMTS-5 (Aggrecanase-2) assay was performed using fluorescent peptide substrate WAAG-3R and the recombinant Agg-2 pre-incubated with various con...
In DepthDetails ArticlePubMed