BDBM28435 3-({[(2R,3S,4R,5R)-5-(6-amino-9H-purin-9-yl)-3,4-dihydroxyoxolan-2-yl]methyl}(methyl)amino)propanamide::AdoMet substrate analogue, 17j
SMILES CN(CCC(N)=O)C[C@H]1O[C@H]([C@H](O)[C@@H]1O)n1cnc2c(N)ncnc12
InChI Key InChIKey=DUDLRRMBOATNME-FRJWGUMJSA-N
Data  1 IC50
  Tab Delimited (TSV)   2D SDfile   Computed 3D by Vconf -m prep SDfile
Find this compound or compounds like it in BindingDB:
Activity Spreadsheet -- Enzyme Inhibition Constant Data from BindingDB
Found 1 hit for monomerid = 28435
TargetS-adenosylmethionine decarboxylase proenzyme(Homo sapiens (Human))
Cornell University
LigandPNGBDBM28435(3-({[(2R,3S,4R,5R)-5-(6-amino-9H-purin-9-yl)-3,4-d...)
Affinity DataIC50:  7.00E+3nMpH: 6.8 T: 2°C. Assay description: The C-terminal his-tagged AdoMetDC was assayed by measuring the release of 14CO2 from S-adenosyl-L-[carboxy-14C]methionine (Amersham Pharmacia Biotec...
In DepthDetails ArticlePubMed