BDBM286835 7-(3-Amino-azetidin-1-ylmethyl)-8-chloro-3-(5-chloro-2-ethanesulfonyl-benzyl)-6-trifluoromethyl-1H-quinazoline-2,4-dione::US9567304, Compound F-110
SMILES CCS(=O)(=O)c1ccc(Cl)cc1Cn1c(=O)[nH]c2c(Cl)c(CN3CC(N)C3)c(cc2c1=O)C(F)(F)F
InChI Key InChIKey=GZWOSSQPYIVXBB-UHFFFAOYSA-N
Data  1 IC50
  Tab Delimited (TSV)   2D SDfile   Computed 3D by Vconf -m prep SDfile
Find this compound or compounds like it in BindingDB:
Activity Spreadsheet -- Enzyme Inhibition Constant Data from BindingDB
Found 1 hit for monomerid = 286835
TargetEpithelial discoidin domain-containing receptor 1(Homo sapiens (Human))
Chugai Seiyaku Kabushiki Kaisha
US Patent
LigandPNGBDBM286835(7-(3-Amino-azetidin-1-ylmethyl)-8-chloro-3-(5-chlo...)
Affinity DataIC50:  41nMT: 2°C. Assay description: DDR1 binding activity was measured using the LanthaScreen(Registered trademark) Eu Kinase Binding Assay (manufactured by Life Technologies Corporatio...
Ligand InfoPC cidPC sid
In DepthDetails US Patent