BDBM288691 TC001207::US10092529, Compound 24
SMILES CCC(C)(C)C(=O)N1[C@@H](CC1=O)c1ccccc1
InChI Key InChIKey=KMPQAQLTXLDQBC-LBPRGKRZSA-N
Data  1 KI
  Tab Delimited (TSV)   2D SDfile   Computed 3D by Vconf -m prep SDfile
Find this compound or compounds like it in BindingDB:
Activity Spreadsheet -- Enzyme Inhibition Constant Data from BindingDB
Found 1 hit for monomerid = 288691
TargetReceptor-interacting serine/threonine-protein kinase 1(Homo sapiens (Human))
National Institute Of Biological Sciences, Beijing
US Patent
LigandPNGBDBM288691(TC001207 | US10092529, Compound 24)
Affinity DataKi:  19.8nM ΔG°:  -10.5kcal/moleT: 2°C. Assay description: Materials: Recombinant full-length RIPK1 protein with N-terminal GST-tag (Cat#R07-34G) was purchased from SignalChem. The ADP-Glo kinase assay kit (C...
Ligand InfoPC cidPC sid
In DepthDetails US Patent