BDBM299214 US10125148, Example 11
SMILES C[C@@H]1Oc2ccc(C)c(F)c2-c2cccc(c2)-c2cc3nc(C)c([C@H](OC(C)(C)C)C(O)=O)c(N4CCC(C)(CC4)OC\C=C\1)n3n2
InChI Key InChIKey=ZFUXIQCCJMWNBB-LOINJGHTSA-N
Data  1 EC50
  Tab Delimited (TSV)   2D SDfile   Computed 3D by Vconf -m prep SDfile
Find this compound or compounds like it in BindingDB:
Activity Spreadsheet -- Enzyme Inhibition Constant Data from BindingDB
Found 1 hit for monomerid = 299214
TargetEnvelope glycoprotein gp160(Human immunodeficiency virus type 1 (isolate BRU/L...)
Viiv Healthcare UK (NO.5)
US Patent
LigandPNGBDBM299214(US10125148, Example 11)
Affinity DataEC50:  3nM. Assay description: Inhibition of HIV replication. A recombinant NL-Rluc virus was constructed in which a section of the nef gene from NL4-3 was replaced with the Renill...
Ligand InfoPC cidPC sid
In DepthDetails US Patent