BDBM30461 benzothiazine-containing analog, 3e
SMILES CS(=O)(=O)Nc1ccc2N=C(CS(=O)(=O)c2c1)c1c(O)c(nn(Cc2ccccc2)c1=O)-c1cccs1
InChI Key InChIKey=NTQFBJJWECXMMS-UHFFFAOYSA-N
Data  1 IC50  1 EC50
  Tab Delimited (TSV)   2D SDfile   Computed 3D by Vconf -m prep SDfile
Find this compound or compounds like it in BindingDB:
Activity Spreadsheet -- Enzyme Inhibition Constant Data from BindingDB
Found 1 hit for monomerid = 30461
TargetGenome polyprotein(Hepatitis C virus genotype 1b (isolate BK) (HCV))
Anadys Pharmaceuticals
LigandPNGBDBM30461(benzothiazine-containing analog, 3e)
Affinity DataIC50:  18nM EC50:  36nMpH: 7.5 T: 2°C. Assay description: Assays were performed in a 96-well streptavidin-coated Flash-Plate using enzyme, RNA substrate, and [alpha-33P]GTP/GTP with inhibitor concentration v...
In DepthDetails ArticlePubMed