BDBM30505 5,6-Dihydro-1H-pyridin-2-one, 4e
SMILES CS(=O)(=O)Nc1ccc2N=C(NS(=O)(=O)c2c1)C1C(=O)C2CCCCC2N(Cc2ccc(F)cc2)C1=O
InChI Key InChIKey=GPSMZISPBDHPAR-UHFFFAOYSA-N
Data  1 IC50  1 EC50
  Tab Delimited (TSV)   2D SDfile   Computed 3D by Vconf -m prep SDfile
Find this compound or compounds like it in BindingDB:
Activity Spreadsheet -- Enzyme Inhibition Constant Data from BindingDB
Found 1 hit for monomerid = 30505
TargetGenome polyprotein(Hepatitis C virus genotype 1b (isolate BK) (HCV))
Anadys Pharmaceuticals
LigandPNGBDBM30505(5,6-Dihydro-1H-pyridin-2-one, 4e)
Affinity DataIC50:  22nM EC50:  150nMpH: 7.5 T: 2°C. Assay description: Assays were performed in a 96-well streptavidin-coated Flash-Plate using enzyme, RNA substrate, and [alpha-33P]GTP/GTP with inhibitor concentration v...
In DepthDetails ArticlePubMed