BDBM310642 US10150762, Example 3/9
SMILES CCN(CC)C(=O)c1nc(sc1-c1ccc(c(Cl)c1Cl)C(O)(C(F)(F)F)C(F)(F)F)C(=O)NCC1(O)CC1
InChI Key InChIKey=MDCVSTFVJWJXBC-UHFFFAOYSA-N
Data  1 IC50  1 Kd
  Tab Delimited (TSV)   2D SDfile   Computed 3D by Vconf -m prep SDfile
Find this compound or compounds like it in BindingDB:
Activity Spreadsheet -- Enzyme Inhibition Constant Data from BindingDB
Found 2 hits for monomerid = 310642
TargetNuclear receptor ROR-gamma(Homo sapiens (Human))
Janssen Pharmaceutica
US Patent
LigandPNGBDBM310642(US10150762, Example 3/9)
Affinity DataIC50:  29nM. Assay description: Cells used in this assay were transiently co-transfected with three different plasmids, one expressing the GAL4-DNA binding domain (DBD)-RORγt f...
Ligand InfoPC cidPC sid
In DepthDetails US Patent
TargetNuclear receptor ROR-gamma(Homo sapiens (Human))
Janssen Pharmaceutica
US Patent
LigandPNGBDBM310642(US10150762, Example 3/9)
Affinity DataKd:  19nM. Assay description: Project compounds were arranged in a pre-dosed mother plate (Greiner Bio-one) wherein compounds are serially diluted in 100% DMSO by 1:2 from a high ...
Ligand InfoPC cidPC sid
In DepthDetails US Patent