BDBM312905 5-amino-2-[3-[2-[(3R)-3-hy- droxy-1-methyl-2-oxo-pyrroli- din-3-yl]ethynyl]phenyl] thiazole-4-carboxamide::US10550117, Compound C-6::US9605005, Example 195
SMILES CN1CC[C@@](O)(C#Cc2cccc(c2)-c2nc(C(N)=O)c(N)s2)C1=O
InChI Key InChIKey=PNYBHJVQEDZSEB-KRWDZBQOSA-N
Data  2 KI
  Tab Delimited (TSV)   2D SDfile   Computed 3D by Vconf -m prep SDfile
Find this compound or compounds like it in BindingDB:
Activity Spreadsheet -- Enzyme Inhibition Constant Data from BindingDB
Found 2 hits for monomerid = 312905
TargetInhibitor of nuclear factor kappa-B kinase subunit beta(Homo sapiens (Human))
Genentech
US Patent
LigandPNGBDBM312905(5-amino-2-[3-[2-[(3R)-3-hy- droxy-1-methyl-2-oxo-p...)
Affinity DataKi:  0.0500nM. Assay description: The ability of the nuclear factor-kappa B (NF-kB)-inducing kinase (NIK) to catalyze the hydrolysis of adenosine-5′-triphosphate (ATP) was monit...
Ligand InfoPC cidPC sid
In DepthDetails US Patent
TargetMitogen-activated protein kinase kinase kinase 14(Homo sapiens (Human))
Genentech
US Patent
LigandPNGBDBM312905(5-amino-2-[3-[2-[(3R)-3-hy- droxy-1-methyl-2-oxo-p...)
Affinity DataKi:  0.130nM. Assay description: The ability of the nuclear factor-kappa B (NF-kB)-inducing kinase (NIK) to catalyze the hydrolysis of adenosine-5′-triphosphate (ATP) was monit...
Ligand InfoPC cidPC sid
In DepthDetails US Patent