BDBM31509 Substituted Benzamide Derivative, 5a
SMILES C[C@@H](NC(=O)c1cccc(C)c1)c1ccc2ccccc2c1
InChI Key InChIKey=LVNRFCFYRYHIAZ-OAHLLOKOSA-N
Data  1 IC50
  Tab Delimited (TSV)   2D SDfile   Computed 3D by Vconf -m prep SDfile
Find this compound or compounds like it in BindingDB:
Activity Spreadsheet -- Enzyme Inhibition Constant Data from BindingDB
Found 1 hit for monomerid = 31509
TargetReplicase polyprotein 1ab [1541-1855](Human SARS coronavirus (SARS-CoV))
Purdue University
LigandPNGBDBM31509(Substituted Benzamide Derivative, 5a)
Affinity DataIC50:  1.48E+4nMpH: 7.5 T: 2°C. Assay description: IC50 values for all inhibitors were determined using a 96-well plate based assay. Reactions were performed in buffer containing RLRGG-AMC, 2% DMSO, a...
In DepthDetails ArticlePubMed