BDBM316326 Cis-2-[2-(3-Chlorophenyl)-6-[3-[(4-cyano-1-piperidyl)methyl]cyclobutyl]-4-oxo-quinazolin-3-yl]-N-isopropyl-acetamide::US9617226, Example 7
SMILES CC(C)NC(=O)Cn1c(nc2ccc(cc2c1=O)[C@@H]1C[C@H](CN2CCC(CC2)C#N)C1)-c1cccc(Cl)c1
InChI Key InChIKey=YIXUAFHPZBRDRH-PEPAQOBHSA-N
Data  1 KI
  Tab Delimited (TSV)   2D SDfile   Computed 3D by Vconf -m prep SDfile
Find this compound or compounds like it in BindingDB:
Activity Spreadsheet -- Enzyme Inhibition Constant Data from BindingDB
Found 1 hit for monomerid = 316326
TargetVasopressin V1a receptor(Homo sapiens (Human))
Abbvie Deutschland
US Patent
LigandPNGBDBM316326(Cis-2-[2-(3-Chlorophenyl)-6-[3-[(4-cyano-1-piperid...)
Affinity DataKi:  55nM. Assay description: The binding assay was carried out by the method based on that of Tahara et al. (Tahara A et al., Brit. J. Pharmacol. 125, 1463-1470 (1998)).The incub...
Ligand InfoPC cidPC sid
In DepthDetails US Patent