BDBM317857 US10399976, Compound 10::US11535614, Compound 10::US9624217, Compound 10
SMILES CCOC(=O)c1cnc(nc1C(F)(F)F)N1Cc2cc(cnc2[C@@H]1C(C)C)C(=O)NCc1ccc(cc1)S(=O)(=O)CC
InChI Key InChIKey=AGTNFOCIKYFLQJ-QHCPKHFHSA-N
Data  3 KI  1 IC50
  Tab Delimited (TSV)   2D SDfile   Computed 3D by Vconf -m prep SDfile
Find this compound or compounds like it in BindingDB:
Activity Spreadsheet -- Enzyme Inhibition Constant Data from BindingDB
Found 4 hits for monomerid = 317857
TargetNuclear receptor ROR-gamma(Homo sapiens (Human))
Vitae Pharmaceuticals
US Patent
LigandPNGBDBM317857(US10399976, Compound 10 | US11535614, Compound 10 ...)
Affinity DataKi: <100nM. Assay description: Compounds of the present invention were tested for ability to bind to RORγ in a cell-free competition assay with commercially available radio-li...
Ligand InfoPC cidPC sid
In DepthDetails US Patent
TargetNuclear receptor ROR-gamma(Homo sapiens (Human))
Vitae Pharmaceuticals
US Patent
LigandPNGBDBM317857(US10399976, Compound 10 | US11535614, Compound 10 ...)
Affinity DataKi: <100nM. Assay description: Compounds of the present invention were tested for ability to bind to RORγ in a cell-free competition assay with commercially available radio-li...
Ligand InfoPC cidPC sid
In DepthDetails US Patent
TargetNuclear receptor ROR-gamma(Homo sapiens (Human))
Vitae Pharmaceuticals
US Patent
LigandPNGBDBM317857(US10399976, Compound 10 | US11535614, Compound 10 ...)
Affinity DataKi: <100nM. Assay description: Compounds of the present invention were tested for ability to bind to ROR gamma in a cell-free competition assay with commercially available radio-li...
Ligand InfoPC cidPC sid
In DepthDetails US Patent
TargetNuclear receptor ROR-gamma(Homo sapiens (Human))
Vitae Pharmaceuticals
US Patent
LigandPNGBDBM317857(US10399976, Compound 10 | US11535614, Compound 10 ...)
Affinity DataIC50: >1.00E+3nM. Assay description: Compounds of the present invention were tested for ROR gamma inverse agonist activity in a cell-based, transcriptional activity assay. Secreted Nanol...
Ligand InfoPC cidPC sid
In DepthDetails US Patent