BDBM322286 6-chloro-N-(1''-azaspiro[cyclopropane-1,2''-bicyclo[2.2.2]octan]-3''-yl)benzo[b]thiophene-2-carboxamide::US10183938, Compound 65a::US10183938, Compound 65b
SMILES Clc1ccc2cc(sc2c1)C(=O)NC1C2CCN(CC2)C11CC1
InChI Key InChIKey=QFCHNIAQEGRJIH-UHFFFAOYSA-N
Data  3 KI
  Tab Delimited (TSV)   2D SDfile   Computed 3D by Vconf -m prep SDfile
Find this compound or compounds like it in BindingDB:
Activity Spreadsheet -- Enzyme Inhibition Constant Data from BindingDB
Found 3 hits for monomerid = 322286
TargetNeuronal acetylcholine receptor subunit alpha-7(Homo sapiens (Human))
Axovant Sciences
US Patent
LigandPNGBDBM322286(6-chloro-N-(1''-azaspiro[cyclopropane-1,2''-bicycl...)
Affinity DataKi:  180nM. Assay description: The ability of compounds to displace binding of radioactive ligands from human α7 nAChR was determined, as a measure of the affinity of the comp...
Ligand InfoPC cidPC sid
In DepthDetails US Patent
Target5-hydroxytryptamine receptor 3A(Homo sapiens (Human))
Axovant Sciences
US Patent
LigandPNGBDBM322286(6-chloro-N-(1''-azaspiro[cyclopropane-1,2''-bicycl...)
Affinity DataKi: >1.00E+4nM. Assay description: [3H]BRL 43694 competition binding assay was performed under contract by Cerep Poitiers, France following the methods described in Hope, A. G et al., ...
Ligand InfoPC cidPC sid
In DepthDetails US Patent
TargetNeuronal acetylcholine receptor subunit alpha-7(Homo sapiens (Human))
Axovant Sciences
US Patent
LigandPNGBDBM322286(6-chloro-N-(1''-azaspiro[cyclopropane-1,2''-bicycl...)
Affinity DataKi:  2.00E+4nM. Assay description: The ability of compounds to displace binding of radioactive ligands from human α7 nAChR was determined, as a measure of the affinity of the comp...
Ligand InfoPC cidPC sid
In DepthDetails US Patent