BDBM322368 (R)-N-(2,2-dimethylquinuclidin-3-yl)-7-phenylbenzo[b]thiophene-2-carboxamide::US10183938, Compound (R)-132
SMILES CC1(C)[C@H](NC(=O)c2cc3cccc(-c4ccccc4)c3s2)C2CCN1CC2
InChI Key InChIKey=YLVNDFYGPNTLDN-JOCHJYFZSA-N
Data  2 KI
  Tab Delimited (TSV)   2D SDfile   Computed 3D by Vconf -m prep SDfile
Find this compound or compounds like it in BindingDB:
Activity Spreadsheet -- Enzyme Inhibition Constant Data from BindingDB
Found 2 hits for monomerid = 322368
Target5-hydroxytryptamine receptor 3A(Homo sapiens (Human))
Axovant Sciences
US Patent
LigandPNGBDBM322368((R)-N-(2,2-dimethylquinuclidin-3-yl)-7-phenylbenzo...)
Affinity DataKi:  100nM. Assay description: [3H]BRL 43694 competition binding assay was performed under contract by Cerep Poitiers, France following the methods described in Hope, A. G et al., ...
Ligand InfoPC cidPC sid
In DepthDetails US Patent
TargetNeuronal acetylcholine receptor subunit alpha-7(Homo sapiens (Human))
Axovant Sciences
US Patent
LigandPNGBDBM322368((R)-N-(2,2-dimethylquinuclidin-3-yl)-7-phenylbenzo...)
Affinity DataKi:  250nM. Assay description: The ability of compounds to displace binding of radioactive ligands from human α7 nAChR was determined, as a measure of the affinity of the comp...
Ligand InfoPC cidPC sid
In DepthDetails US Patent