BDBM323640 (R)-(2-(3-(2- ethoxyphenoxy)piperidin- 1-yl)pyrimidin-5-yl)(3- methoxyazetidin-1- yl)methanone::US10188653, Example 19.9::US9789110, 19.9
SMILES CCOc1ccccc1O[C@@H]1CCCN(C1)c1ncc(cn1)C(=O)N1CC(C1)OC
InChI Key InChIKey=BNKPSOQGYCXOHT-QGZVFWFLSA-N
Data  2 IC50
  Tab Delimited (TSV)   2D SDfile   Computed 3D by Vconf -m prep SDfile
Find this compound or compounds like it in BindingDB:
Activity Spreadsheet -- Enzyme Inhibition Constant Data from BindingDB
Found 2 hits for monomerid = 323640
TargetDiacylglycerol O-acyltransferase 2(Homo sapiens (Human))
Pfizer
US Patent
LigandPNGBDBM323640((R)-(2-(3-(2- ethoxyphenoxy)piperidin- 1-yl)pyrimi...)
Affinity DataIC50:  14.3nM. Assay description: For determination of IC50 values, the reactions were carried out in 384-well white Polyplates (Perkin Elmer) in a total volume of 20 μL. To 14 o...
Ligand InfoPC cidPC sid
In DepthDetails US Patent
TargetDiacylglycerol O-acyltransferase 2(Homo sapiens (Human))
Pfizer
US Patent
LigandPNGBDBM323640((R)-(2-(3-(2- ethoxyphenoxy)piperidin- 1-yl)pyrimi...)
Affinity DataIC50:  14.3nM. Assay description: For determination of IC50 values, the reactions were carried out in 384-well white Polyplates (Perkin Elmer) in a total volume of 20 μL. To 14 o...
Ligand InfoPC cidPC sid
In DepthDetails US Patent