BDBM325352 (R)-2-methyl-3-(4-(4-(1- (pentan-3-yl)-1H-pyrazol-4- yl)pyrazolo[1,5-a]pyrazin-6- yl)-1H-pyrazol-1-yl)propan- 1-ol::US10189845, Example 14::US10730880, Example 14::US11028093, Example 14
SMILES CCC(CC)n1cc(cn1)-c1nc(cn2nccc12)-c1cnn(C[C@@H](C)CO)c1
InChI Key InChIKey=UYDZAZNDTNXIDX-OAHLLOKOSA-N
Data  12 IC50
  Tab Delimited (TSV)   2D SDfile   Computed 3D by Vconf -m prep SDfile
Find this compound or compounds like it in BindingDB:
Activity Spreadsheet -- Enzyme Inhibition Constant Data from BindingDB
Found 12 hits for monomerid = 325352
TargetNon-receptor tyrosine-protein kinase TYK2(Homo sapiens (Human))
Array Biopharma
US Patent
LigandPNGBDBM325352((R)-2-methyl-3-(4-(4-(1- (pentan-3-yl)-1H-pyrazol-...)
Affinity DataIC50:  55nM. Assay description: Compounds of Formula I were screened for their ability to inhibit Tyk2 using the general enzyme inhibition assay method, in which the assay mixture c...
Ligand InfoPC cidPC sid
In DepthDetails US Patent
TargetTyrosine-protein kinase JAK1(Homo sapiens (Human))
Array Biopharma
US Patent
LigandPNGBDBM325352((R)-2-methyl-3-(4-(4-(1- (pentan-3-yl)-1H-pyrazol-...)
Affinity DataIC50:  55nM. Assay description: Compounds of Formula I were screened for their ability to inhibit JAK1 using the general enzyme inhibition assay method, in which the assay mixture c...
Ligand InfoPC cidPC sid
In DepthDetails US Patent
TargetTyrosine-protein kinase JAK2(Homo sapiens (Human))
Array Biopharma
US Patent
LigandPNGBDBM325352((R)-2-methyl-3-(4-(4-(1- (pentan-3-yl)-1H-pyrazol-...)
Affinity DataIC50:  55nM. Assay description: Compounds of Formula I were screened for their ability to inhibit JAK2 using the general enzyme inhibition assay method, in which the assay mixture c...
Ligand InfoPC cidPC sid
In DepthDetails US Patent
TargetTyrosine-protein kinase JAK3(Homo sapiens (Human))
Array Biopharma
US Patent
LigandPNGBDBM325352((R)-2-methyl-3-(4-(4-(1- (pentan-3-yl)-1H-pyrazol-...)
Affinity DataIC50:  5.50E+3nM. Assay description: Compounds of Formula I were screened for their ability to inhibit JAK3 using the general enzyme inhibition assay method, in which the assay mixture c...
Ligand InfoPC cidPC sid
In DepthDetails US Patent
TargetNon-receptor tyrosine-protein kinase TYK2(Homo sapiens (Human))
Array Biopharma
US Patent
LigandPNGBDBM325352((R)-2-methyl-3-(4-(4-(1- (pentan-3-yl)-1H-pyrazol-...)
Affinity DataIC50:  55nM. Assay description: Compounds of Formula I were screened for their ability to inhibit Tyk2 using the general enzyme inhibition assay method, in which the assay mixture c...
Ligand InfoPC cidPC sid
In DepthDetails US Patent
TargetTyrosine-protein kinase JAK3(Homo sapiens (Human))
Array Biopharma
US Patent
LigandPNGBDBM325352((R)-2-methyl-3-(4-(4-(1- (pentan-3-yl)-1H-pyrazol-...)
Affinity DataIC50:  5.50E+3nM. Assay description: Compounds of Formula I were screened for their ability to inhibit JAK3 using the general enzyme inhibition assay method, in which the assay mixture c...
Ligand InfoPC cidPC sid
In DepthDetails US Patent
TargetTyrosine-protein kinase JAK2(Homo sapiens (Human))
Array Biopharma
US Patent
LigandPNGBDBM325352((R)-2-methyl-3-(4-(4-(1- (pentan-3-yl)-1H-pyrazol-...)
Affinity DataIC50:  55nM. Assay description: Compounds of Formula I were screened for their ability to inhibit JAK2 using the general enzyme inhibition assay method, in which the assay mixture c...
Ligand InfoPC cidPC sid
In DepthDetails US Patent
TargetTyrosine-protein kinase JAK3(Homo sapiens (Human))
Array Biopharma
US Patent
LigandPNGBDBM325352((R)-2-methyl-3-(4-(4-(1- (pentan-3-yl)-1H-pyrazol-...)
Affinity DataIC50:  5.50E+3nM. Assay description: Compounds of Formula I were screened for their ability to inhibit JAK3 using the general enzyme inhibition assay method, in which the assay mixture c...
Ligand InfoPC cidPC sid
In DepthDetails US Patent
TargetNon-receptor tyrosine-protein kinase TYK2(Homo sapiens (Human))
Array Biopharma
US Patent
LigandPNGBDBM325352((R)-2-methyl-3-(4-(4-(1- (pentan-3-yl)-1H-pyrazol-...)
Affinity DataIC50:  55nM. Assay description: Compounds of Formula I were screened for their ability to inhibit Tyk2 using the general enzyme inhibition assay method, in which the assay mixture c...
Ligand InfoPC cidPC sid
In DepthDetails US Patent
TargetTyrosine-protein kinase JAK1(Homo sapiens (Human))
Array Biopharma
US Patent
LigandPNGBDBM325352((R)-2-methyl-3-(4-(4-(1- (pentan-3-yl)-1H-pyrazol-...)
Affinity DataIC50:  55nM. Assay description: Compounds of Formula I were screened for their ability to inhibit JAK1 using the general enzyme inhibition assay method, in which the assay mixture c...
Ligand InfoPC cidPC sid
In DepthDetails US Patent
TargetTyrosine-protein kinase JAK2(Homo sapiens (Human))
Array Biopharma
US Patent
LigandPNGBDBM325352((R)-2-methyl-3-(4-(4-(1- (pentan-3-yl)-1H-pyrazol-...)
Affinity DataIC50:  55nM. Assay description: Compounds of Formula I were screened for their ability to inhibit JAK2 using the general enzyme inhibition assay method, in which the assay mixture c...
Ligand InfoPC cidPC sid
In DepthDetails US Patent
TargetTyrosine-protein kinase JAK1(Homo sapiens (Human))
Array Biopharma
US Patent
LigandPNGBDBM325352((R)-2-methyl-3-(4-(4-(1- (pentan-3-yl)-1H-pyrazol-...)
Affinity DataIC50:  55nM. Assay description: Compounds of Formula I were screened for their ability to inhibit JAK1 using the general enzyme inhibition assay method, in which the assay mixture c...
Ligand InfoPC cidPC sid
In DepthDetails US Patent