BDBM33211 purine, 10
SMILES NCC1CN(CCO1)c1ncnc2nc[nH]c12
InChI Key InChIKey=VNGSDLIBIYNHKQ-UHFFFAOYSA-N
Data  1 IC50
PDB links: 1 PDB ID matches this monomer.
  Tab Delimited (TSV)   2D SDfile   Computed 3D by Vconf -m prep SDfile
Find this compound or compounds like it in BindingDB:
Activity Spreadsheet -- Enzyme Inhibition Constant Data from BindingDB
Found 1 hit for monomerid = 33211
TargetSerine/threonine-protein kinase Chk1(Homo sapiens (Human))
The Institute Of Cancer Research
LigandPNGBDBM33211(purine, 10)
Affinity DataIC50:  9.20E+3nMpH: 7.5 T: 2°C. Assay description: CHK kinase function was measured in a DELFIA assay in order to monitor phosphorylation of a CDC25C peptide using a specific phospho antibody. The enz...