BDBM332942 US10196390, Compound I-231::US10336752, Compound 9::US11040967, Compound 9
SMILES Fc1cccc(F)c1-c1cc(Nc2ccc(cc2)C(=O)N2CCOCC2)c2C(=O)NCc2n1
InChI Key InChIKey=XDTKWAGKBLDFOE-UHFFFAOYSA-N
Data  3 KI  5 IC50
  Tab Delimited (TSV)   2D SDfile   Computed 3D by Vconf -m prep SDfile
Find this compound or compounds like it in BindingDB:
Activity Spreadsheet -- Enzyme Inhibition Constant Data from BindingDB
Found 8 hits for monomerid = 332942
TargetNon-receptor tyrosine-protein kinase TYK2(Homo sapiens (Human))
Nimbus Therapeutics
Curated by ChEMBL
LigandPNGBDBM332942(US10196390, Compound I-231 | US10336752, Compound ...)
Affinity DataKi:  0.350nM. Assay description: Inhibition of TYK2 JH1 domain (unknown origin) measured in presence of 10 uM ATP
Ligand InfoPC cidPC sid
In DepthDetails ArticlePubMed
TargetNon-receptor tyrosine-protein kinase TYK2(Homo sapiens (Human))
Nimbus Therapeutics
Curated by ChEMBL
LigandPNGBDBM332942(US10196390, Compound I-231 | US10336752, Compound ...)
Affinity DataKi: <10nM. Assay description: The caliper machine employs an off chip mobility shift assay to detect phosphorylated peptide substrates from kinase assays, using microfluidics tech...
Ligand InfoPC cidPC sid
In DepthDetails US Patent
TargetTyrosine-protein kinase JAK2(Homo sapiens (Human))
Nimbus Lakshmi
US Patent
LigandPNGBDBM332942(US10196390, Compound I-231 | US10336752, Compound ...)
Affinity DataKi:  55nM
Ligand InfoPC cidPC sid
In DepthDetails US Patent
TargetTyrosine-protein kinase JAK2(Homo sapiens (Human))
Nimbus Lakshmi
US Patent
LigandPNGBDBM332942(US10196390, Compound I-231 | US10336752, Compound ...)
Affinity DataIC50:  2.80E+3nM. Assay description: Inhibition of Jak2 in human PBMC assessed as inhibition of GM-CSF-stimulated phosphorylation of STAT5
Ligand InfoPC cidPC sid
In DepthDetails ArticlePubMed
TargetNon-receptor tyrosine-protein kinase TYK2(Homo sapiens (Human))
Nimbus Therapeutics
Curated by ChEMBL
LigandPNGBDBM332942(US10196390, Compound I-231 | US10336752, Compound ...)
Affinity DataIC50:  89nM. Assay description: Inhibition of TYK2 in human PBMC assessed as inhibition of IL-12-stimulated phosphorylation of STAT4 measured by immunoblotting method
Ligand InfoPC cidPC sid
In DepthDetails ArticlePubMed
TargetJAK3/JAK1(Homo sapiens (Human))
Nimbus Therapeutics
Curated by ChEMBL
LigandPNGBDBM332942(US10196390, Compound I-231 | US10336752, Compound ...)
Affinity DataIC50:  170nM. Assay description: Inhibition of Jak1/Jak3 in human PBMC assessed as inhibition of IL2-stimulated phosphorylation of STAT5
Ligand InfoPC cidPC sid
In DepthDetails ArticlePubMed
TargetNon-receptor tyrosine-protein kinase TYK2(Homo sapiens (Human))
Nimbus Therapeutics
Curated by ChEMBL
LigandPNGBDBM332942(US10196390, Compound I-231 | US10336752, Compound ...)
Affinity DataIC50:  134nM. Assay description: Compounds were serially diluted in DMSO then further diluted in 1x kinase buffer: 5 uL of buffer diluted compound was added into wells first, then 10...
Ligand InfoPC cidPC sid
In DepthDetails US Patent
TargetNon-receptor tyrosine-protein kinase TYK2(Homo sapiens (Human))
Nimbus Therapeutics
Curated by ChEMBL
LigandPNGBDBM332942(US10196390, Compound I-231 | US10336752, Compound ...)
Affinity DataIC50:  134nM. Assay description: Compounds were serially diluted in DMSO then further diluted in 1× kinase buffer: 5 uL of buffer diluted compound was added into wells first, then 10...
Ligand InfoPC cidPC sid
In DepthDetails US Patent