BDBM334611 US11040966, Example 3.33::US9732075, Example 3.33::[(2S,4R)-2-(6-Chloro-7-methyl-1H-benzoimidazol-2-yl)-4-methoxy-pyrrolidin-1-yl]-[2-dimethylamino-5-(3,4-dimethyl-phenyl)-thiazol-4-yl]-methanone
SMILES CO[C@@H]1C[C@H](N(C1)C(=O)c1nc(sc1-c1ccc(C)c(C)c1)N(C)C)c1nc2ccc(Cl)c(C)c2[nH]1
InChI Key InChIKey=BRMIJZHNESDJJS-NQIIRXRSSA-N
Data  2 IC50
  Tab Delimited (TSV)   2D SDfile   Computed 3D by Vconf -m prep SDfile
Find this compound or compounds like it in BindingDB:
Activity Spreadsheet -- Enzyme Inhibition Constant Data from BindingDB
Found 2 hits for monomerid = 334611
TargetOrexin receptor type 2(Homo sapiens (Human))
Idorsia Pharmaceuticals
US Patent
LigandPNGBDBM334611(US11040966, Example 3.33 | US9732075, Example 3.33...)
Affinity DataIC50:  10nM. Assay description: Chinese hamster ovary (CHO) cells expressing the human orexin-1 receptor and the human orexin-2 receptor, respectively, are grown in culture medium (...
Ligand InfoPC cidPC sid
In DepthDetails US Patent
TargetOrexin/Hypocretin receptor type 1(Homo sapiens (Human))
Idorsia Pharmaceuticals
US Patent
LigandPNGBDBM334611(US11040966, Example 3.33 | US9732075, Example 3.33...)
Affinity DataIC50:  0.800nM. Assay description: Chinese hamster ovary (CHO) cells expressing the human orexin-1 receptor and the human orexin-2 receptor, respectively, are grown in culture medium (...
Ligand InfoPC cidPC sid
In DepthDetails US Patent