BDBM335354 US11040966, Example 7.18::US9732075, Example 7.18::[(S)-2-(5-Chloro-1,4-dimethyl-1H-benzoimidazol-2-yl)-2-methyl-pyrrolidin-1-yl]-(6-methyl-3-[1,2,3]triazol-2-yl-pyridin-2-yl)-methanone and/or [(S)-2-(3-Chloro-1,2-dimethyl-1H-benzoimidazol-2-yl)-2-methyl-pyrrolidin-1-yl]-(6-methyl-3-[1,2,3]triazol-2-yl-pyridin-2-yl)-methanone
SMILES Cc1ccc(c(n1)C(=O)N1CCC[C@@]1(C)c1nc2c(C)c(Cl)ccc2n1C)-n1nccn1
InChI Key InChIKey=AZKADNWHMIVDCE-QHCPKHFHSA-N
Data  2 IC50
  Tab Delimited (TSV)   2D SDfile   Computed 3D by Vconf -m prep SDfile
Find this compound or compounds like it in BindingDB:
Activity Spreadsheet -- Enzyme Inhibition Constant Data from BindingDB
Found 2 hits for monomerid = 335354
TargetOrexin receptor type 2(Homo sapiens (Human))
Idorsia Pharmaceuticals
US Patent
LigandPNGBDBM335354(US11040966, Example 7.18 | US9732075, Example 7.18...)
Affinity DataIC50:  4nM. Assay description: Chinese hamster ovary (CHO) cells expressing the human orexin-1 receptor and the human orexin-2 receptor, respectively, are grown in culture medium (...
Ligand InfoPC cidPC sid
In DepthDetails US Patent
TargetOrexin/Hypocretin receptor type 1(Homo sapiens (Human))
Idorsia Pharmaceuticals
US Patent
LigandPNGBDBM335354(US11040966, Example 7.18 | US9732075, Example 7.18...)
Affinity DataIC50:  1nM. Assay description: Chinese hamster ovary (CHO) cells expressing the human orexin-1 receptor and the human orexin-2 receptor, respectively, are grown in culture medium (...
Ligand InfoPC cidPC sid
In DepthDetails US Patent