BDBM34107 glucopyranosylidene-spiro-isoxazoline, 4b
SMILES Cc1ccc(cc1)C1=NO[C@@]2(C1)O[C@H](CO)[C@@H](O)[C@H](O)[C@H]2O
InChI Key InChIKey=GTYOYEGMJMKJRE-UXXRCYHCSA-N
Data  1 KI
  Tab Delimited (TSV)   2D SDfile   Computed 3D by Vconf -m prep SDfile
Find this compound or compounds like it in BindingDB:
Activity Spreadsheet -- Enzyme Inhibition Constant Data from BindingDB
Found 1 hit for monomerid = 34107
TargetGlycogen phosphorylase, muscle form(Oryctolagus cuniculus (rabbit))
Universite De Lyon
LigandPNGBDBM34107(glucopyranosylidene-spiro-isoxazoline, 4b)
Affinity DataKi:  7.90E+3nM ΔG°:  -7.07kcal/molepH: 6.8 T: 2°C. Assay description: Phosphorylase activity was measured in the direction of glycogen synthesis by the release of orthophosphate from Glc-1-P. The enzyme was assayed in g...
In DepthDetails ArticlePubMed