BDBM34543 6-methyl-2-[(1-oxo-2-thiophen-2-ylethyl)amino]-4,5,6,7-tetrahydro-1-benzothiophene-3-carboxylic acid methyl ester::6-methyl-2-[[2-(2-thienyl)acetyl]amino]-4,5,6,7-tetrahydrobenzothiophene-3-carboxylic acid methyl ester::MLS000107127::SMR000111499::cid_2849946::methyl 6-methyl-2-(2-thiophen-2-ylethanoylamino)-4,5,6,7-tetrahydro-1-benzothiophene-3-carboxylate::methyl 6-methyl-2-[(2-thiophen-2-ylacetyl)amino]-4,5,6,7-tetrahydro-1-benzothiophene-3-carboxylate
SMILES COC(=O)c1c(NC(=O)Cc2cccs2)sc2CC(C)CCc12
InChI Key InChIKey=FOZWQDASVSXMSS-UHFFFAOYSA-N
Data  1 EC50
  Tab Delimited (TSV)   2D SDfile   Computed 3D by Vconf -m prep SDfile
Find this compound or compounds like it in BindingDB:
Activity Spreadsheet -- Enzyme Inhibition Constant Data from BindingDB
Found 1 hit for monomerid = 34543
TargetD(1A) dopamine receptor(Homo sapiens (Human))
Vanderbilt Screening Center For Gpcrs, Ion Channels And Transporters
Curated by PubChem BioAssay
LigandPNGBDBM34543(6-methyl-2-[(1-oxo-2-thiophen-2-ylethyl)amino]-4,5...)
Affinity DataEC50:  0.0139nM. Assay description: Assay Provider: Val Watts Assay Provider Affiliation: Purdue University Grant Title: Allosteric Modulators of D1 Receptors Grant Number: 1 X01 MH0776...
In DepthDetails PCBioAssay