BDBM34684 1-(3-methoxyphenyl)-3-[[1-(4-methoxyphenyl)-3-pyrrolidinyl]methyl]urea::1-(3-methoxyphenyl)-3-[[1-(4-methoxyphenyl)pyrrolidin-3-yl]methyl]urea::MLS000521179::SMR000131588::cid_3687658
SMILES COc1ccc(cc1)N1CCC(CNC(=O)Nc2cccc(OC)c2)C1
InChI Key InChIKey=RRSBWYYYFZOZCR-UHFFFAOYSA-N
Data  2 IC50  1 EC50
  Tab Delimited (TSV)   2D SDfile   Computed 3D by Vconf -m prep SDfile
Find this compound or compounds like it in BindingDB:
Activity Spreadsheet -- Enzyme Inhibition Constant Data from BindingDB
Found 3 hits for monomerid = 34684
TargetMannose-6-phosphate isomerase(Homo sapiens (Human))
Burnham Center For Chemical Genomics
Curated by PubChem BioAssay
LigandPNGBDBM34684(1-(3-methoxyphenyl)-3-[[1-(4-methoxyphenyl)-3-pyrr...)
Affinity DataIC50: >5.00E+4nMpH: 7.4 T: 2°C. Assay description: The purpose of this assay is to identify non-competititve inhibitors of human PMI. This is accomplished by using a G6PD- NADPH-coupled assay. In the ...
In DepthDetails PCBioAssay
TargetLarge T antigen(Simian virus 40)
Southern Research Specialized Biocontainment Screening Center
Curated by PubChem BioAssay
LigandPNGBDBM34684(1-(3-methoxyphenyl)-3-[[1-(4-methoxyphenyl)-3-pyrr...)
Affinity DataEC50: >5.00E+4nM. Assay description: Southern Research's Specialized Biocontainment Screening Center (SRSBSC) Southern Research Institute (Birmingham, Alabama) NIH Molecular Librarie...
In DepthDetails PCBioAssay
TargetInduced myeloid leukemia cell differentiation protein Mcl-1(Homo sapiens (Human))
Emory University
Curated by PubChem BioAssay
LigandPNGBDBM34684(1-(3-methoxyphenyl)-3-[[1-(4-methoxyphenyl)-3-pyrr...)
Affinity DataIC50:  3.18E+3nM. Assay description: NIH Molecular Libraries Screening Centers Network [MLSCN] Emory Chemical Biology Discovery Center in MLSCN Assay provider: Nikolovska-Coleska, Univer...
In DepthDetails PCBioAssay