BDBM34907 2-chloranyl-5,7-dimethyl-quinoline-3-carbaldehyde::2-chloro-5,7-dimethyl-3-quinolinecarboxaldehyde::2-chloro-5,7-dimethyl-quinoline-3-carbaldehyde::2-chloro-5,7-dimethylquinoline-3-carbaldehyde::MLS000709258::SMR000289925::cid_818677
SMILES Cc1cc(C)c2cc(C=O)c(Cl)nc2c1
InChI Key InChIKey=DIMGKYRNZAHUIS-UHFFFAOYSA-N
Data  2 IC50
  Tab Delimited (TSV)   2D SDfile   Computed 3D by Vconf -m prep SDfile
Find this compound or compounds like it in BindingDB:
Activity Spreadsheet -- Enzyme Inhibition Constant Data from BindingDB
Found 2 hits for monomerid = 34907
TargetMannose-6-phosphate isomerase(Homo sapiens (Human))
Sanford-Burnham Center For Chemical Genomics
Curated by PubChem BioAssay
LigandPNGBDBM34907(2-chloranyl-5,7-dimethyl-quinoline-3-carbaldehyde ...)
Affinity DataIC50:  1.42E+4nM. Assay description: Data Source: Sanford-Burnham Center for Chemical Genomics (SBCCG) Source Affiliation: Sanford-Burnham Medical Research Institute (SBMRI, San Diego, C...
In DepthDetails PCBioAssay
TargetMannose-6-phosphate isomerase(Homo sapiens (Human))
Sanford-Burnham Center For Chemical Genomics
Curated by PubChem BioAssay
LigandPNGBDBM34907(2-chloranyl-5,7-dimethyl-quinoline-3-carbaldehyde ...)
Affinity DataIC50:  1.71E+4nMpH: 7.4 T: 2°C. Assay description: The purpose of this assay is to identify non-competititve inhibitors of human PMI. This is accomplished by using a G6PD- NADPH-coupled assay. In the ...
In DepthDetails PCBioAssay