BDBM351399 1,4:3,6-dianhydro-2-deoxy-5-O-[4-[(3,4- dichlorophenyl)amino]-6- (methyloxy)quinazolin-7-yl]-2-fluoro-D-iditol::US9796704, Entry 119
SMILES COc1cc2c(Nc3ccc(Cl)c(Cl)c3)ncnc2cc1O[C@@H]1CO[C@H]2[C@H](F)CO[C@@H]12
InChI Key InChIKey=ZDHUWTTUQHECMO-FCDRMGDPSA-N
Data  5 IC50
  Tab Delimited (TSV)   2D SDfile   Computed 3D by Vconf -m prep SDfile
Find this compound or compounds like it in BindingDB:
Activity Spreadsheet -- Enzyme Inhibition Constant Data from BindingDB
Found 5 hits for monomerid = 351399
TargetEphrin type-B receptor 4(Homo sapiens (Human))
Symphony Evolution
US Patent
LigandPNGBDBM351399(1,4:3,6-dianhydro-2-deoxy-5-O-[4-[(3,4- dichloroph...)
Affinity DataIC50: <50nM. Assay description: In AlphaScreen, when the donor and acceptor beads are close in proximity, a series of photochemical events will give rise to a fluorescent signal upo...
Ligand InfoPC cidPC sid
In DepthDetails US Patent
TargetEphrin type-A receptor 2(Homo sapiens (Human))
Symphony Evolution
US Patent
LigandPNGBDBM351399(1,4:3,6-dianhydro-2-deoxy-5-O-[4-[(3,4- dichloroph...)
Affinity DataIC50: <50nM. Assay description: In AlphaScreen, when the donor and acceptor beads are close in proximity, a series of photochemical events will give rise to a fluorescent signal upo...
Ligand InfoPC cidPC sid
In DepthDetails US Patent
TargetReceptor tyrosine-protein kinase erbB-2(Homo sapiens (Human))
Symphony Evolution
US Patent
LigandPNGBDBM351399(1,4:3,6-dianhydro-2-deoxy-5-O-[4-[(3,4- dichloroph...)
Affinity DataIC50: <50nM. Assay description: In AlphaScreen, when the donor and acceptor beads are close in proximity, a series of photochemical events will give rise to a fluorescent signal upo...
Ligand InfoPC cidPC sid
In DepthDetails US Patent
TargetEpidermal growth factor receptor(Homo sapiens (Human))
Symphony Evolution
US Patent
LigandPNGBDBM351399(1,4:3,6-dianhydro-2-deoxy-5-O-[4-[(3,4- dichloroph...)
Affinity DataIC50: <50nM. Assay description: In AlphaScreen, when the donor and acceptor beads are close in proximity, a series of photochemical events will give rise to a fluorescent signal upo...
Ligand InfoPC cidPC sid
In DepthDetails US Patent
TargetVascular endothelial growth factor receptor 2(Homo sapiens (Human))
Symphony Evolution
US Patent
LigandPNGBDBM351399(1,4:3,6-dianhydro-2-deoxy-5-O-[4-[(3,4- dichloroph...)
Affinity DataIC50: <50nM. Assay description: In AlphaScreen, when the donor and acceptor beads are close in proximity, a series of photochemical events will give rise to a fluorescent signal upo...
Ligand InfoPC cidPC sid
In DepthDetails US Patent