BDBM351936 Preparation of 5-(2-((1R,5S)-3-oxa-8-azabicyclo[3.2.1]octan-8-yl)-4-morpholinyl pyrido[2,3-d]pyrimidin-7-yl)-2-methoxyphenylmethanol ::US9796732, Compound 9
SMILES COc1ccc(cc1CO)-c1ccc2c(nc(nc2n1)N1C2CCC1COC2)N1CCOCC1
InChI Key InChIKey=XXSIFYJRCMWAJI-UHFFFAOYSA-N
Data  1 IC50
  Tab Delimited (TSV)   2D SDfile   Computed 3D by Vconf -m prep SDfile
Find this compound or compounds like it in BindingDB:
Activity Spreadsheet -- Enzyme Inhibition Constant Data from BindingDB
Found 1 hit for monomerid = 351936
TargetSerine/threonine-protein kinase mTOR(Homo sapiens (Human))
Shandong Luoxin Pharmaceutical Group Stock
US Patent
LigandPNGBDBM351936(Preparation of 5-(2-((1R,5S)-3-oxa-8-azabicyclo[3....)
Affinity DataIC50:  11nM. Assay description: The test on activity against mTOR Kinase was performed using a 1.7 nM mTOR (Millipore, 14-770M), a 50 nM ULight-4EBP1 (Perkin-Elmer, TRF0128M) and a ...
Ligand InfoPC cidPC sid
In DepthDetails US Patent