BDBM35704 5H-1-benzazepin-5-ylidene acetamide, 10k
SMILES CC1CCCN1c1ccc(C(=O)N2CCC(F)(F)\C(=C/C(=O)NCc3ccccn3)c3ccccc23)c(Cl)c1
InChI Key InChIKey=XGNGRQJMCUROQZ-BWAHOGKJSA-N
Data  1 KI  1 EC50
  Tab Delimited (TSV)   2D SDfile   Computed 3D by Vconf -m prep SDfile
Find this compound or compounds like it in BindingDB:
Activity Spreadsheet -- Enzyme Inhibition Constant Data from BindingDB
Found 1 hit for monomerid = 35704
TargetVasopressin V2 receptor(Homo sapiens (Human))
Astellas Pharma
LigandPNGBDBM35704(5H-1-benzazepin-5-ylidene acetamide, 10k)
Affinity DataKi:  16nM ΔG°:  -10.6kcal/mole EC50:  1.10E+3nMpH: 7.4 T: 2°C. Assay description: The affinities of test compounds for human V2 receptor were evaluated by the radioligand binding study using membrane fractions isolated from CHO cel...
In DepthDetails ArticlePubMed