BDBM35708 5H-1-benzazepin-5-ylidene acetamide, 10o
SMILES CN1CCN(CC1)c1ccc(C(=O)N2CCC(F)(F)\C(=C/C(=O)NCc3ccccn3)c3ccccc23)c(Cl)c1
InChI Key InChIKey=GMOZDFDTQHRGRM-PLRJNAJWSA-N
Data  1 KI  1 EC50
  Tab Delimited (TSV)   2D SDfile   Computed 3D by Vconf -m prep SDfile
Find this compound or compounds like it in BindingDB:
Activity Spreadsheet -- Enzyme Inhibition Constant Data from BindingDB
Found 1 hit for monomerid = 35708
TargetVasopressin V2 receptor(Homo sapiens (Human))
Astellas Pharma
LigandPNGBDBM35708(5H-1-benzazepin-5-ylidene acetamide, 10o)
Affinity DataKi:  170nM ΔG°:  -9.17kcal/mole EC50: >1.00E+4nMpH: 7.4 T: 2°C. Assay description: The affinities of test compounds for human V2 receptor were evaluated by the radioligand binding study using membrane fractions isolated from CHO cel...
In DepthDetails ArticlePubMed