BDBM357716 N-((1-(cyanomethyl)-3-(2,6-difluoro-3,5-dimethoxyphenyl)-2-oxo-1,2,3,4-tetrahydropyrido[4,3-d]pyrimidin-7-yl)methyl)acrylamide::US10214528, Example 20::US10738048, Example 20::US11014923, Example 20::US11667635, Example 20::US9890156, Example 20
SMILES COc1cc(OC)c(F)c(N2Cc3cnc(CNC(=O)C=C)cc3N(CC#N)C2=O)c1F
InChI Key InChIKey=PSAUQLZJRGMGPX-UHFFFAOYSA-N
Data  20 IC50
  Tab Delimited (TSV)   2D SDfile   Computed 3D by Vconf -m prep SDfile
Find this compound or compounds like it in BindingDB:
Activity Spreadsheet -- Enzyme Inhibition Constant Data from BindingDB
Found 20 hits for monomerid = 357716
TargetFibroblast growth factor receptor 1(Homo sapiens (Human))
Incyte
US Patent
LigandPNGBDBM357716(N-((1-(cyanomethyl)-3-(2,6-difluoro-3,5-dimethoxyp...)
Affinity DataIC50: >200nM. Assay description: TBD
Ligand InfoPC cidPC sid
In DepthDetails US Patent
TargetFibroblast growth factor receptor 4(Homo sapiens (Human))
Incyte
US Patent
LigandPNGBDBM357716(N-((1-(cyanomethyl)-3-(2,6-difluoro-3,5-dimethoxyp...)
Affinity DataIC50: <10nM. Assay description: The inhibitor potency of the exemplified compounds was measured in an enzyme assay that measures peptide phosphorylation using FRET measurements to d...
Ligand InfoPC cidPC sid
In DepthDetails US Patent
TargetFibroblast growth factor receptor 3(Homo sapiens (Human))
Incyte
US Patent
LigandPNGBDBM357716(N-((1-(cyanomethyl)-3-(2,6-difluoro-3,5-dimethoxyp...)
Affinity DataIC50: >200nM. Assay description: TBD
Ligand InfoPC cidPC sid
In DepthDetails US Patent
TargetFibroblast growth factor receptor 4(Homo sapiens (Human))
Incyte
US Patent
LigandPNGBDBM357716(N-((1-(cyanomethyl)-3-(2,6-difluoro-3,5-dimethoxyp...)
Affinity DataIC50: <10nM. Assay description: TBD
Ligand InfoPC cidPC sid
In DepthDetails US Patent
TargetFibroblast growth factor receptor 1(Homo sapiens (Human))
Incyte
US Patent
LigandPNGBDBM357716(N-((1-(cyanomethyl)-3-(2,6-difluoro-3,5-dimethoxyp...)
Affinity DataIC50: >200nM. Assay description: The inhibitor potency of the exemplified compounds was measured in an enzyme assay that measures peptide phosphorylation using FRET measurements to d...
Ligand InfoPC cidPC sid
In DepthDetails US Patent
TargetFibroblast growth factor receptor 2(Homo sapiens (Human))
Incyte
US Patent
LigandPNGBDBM357716(N-((1-(cyanomethyl)-3-(2,6-difluoro-3,5-dimethoxyp...)
Affinity DataIC50: >200nM. Assay description: The inhibitor potency of the exemplified compounds was measured in an enzyme assay that measures peptide phosphorylation using FRET measurements to d...
Ligand InfoPC cidPC sid
In DepthDetails US Patent
TargetFibroblast growth factor receptor 3(Homo sapiens (Human))
Incyte
US Patent
LigandPNGBDBM357716(N-((1-(cyanomethyl)-3-(2,6-difluoro-3,5-dimethoxyp...)
Affinity DataIC50: >200nM. Assay description: The inhibitor potency of the exemplified compounds was measured in an enzyme assay that measures peptide phosphorylation using FRET measurements to d...
Ligand InfoPC cidPC sid
In DepthDetails US Patent
TargetFibroblast growth factor receptor 4(Homo sapiens (Human))
Incyte
US Patent
LigandPNGBDBM357716(N-((1-(cyanomethyl)-3-(2,6-difluoro-3,5-dimethoxyp...)
Affinity DataIC50: <10nM. Assay description: The inhibitor potency of the exemplified compounds was measured in an enzyme assay that measures peptide phosphorylation using FRET measurements to d...
Ligand InfoPC cidPC sid
In DepthDetails US Patent
TargetFibroblast growth factor receptor 1(Homo sapiens (Human))
Incyte
US Patent
LigandPNGBDBM357716(N-((1-(cyanomethyl)-3-(2,6-difluoro-3,5-dimethoxyp...)
Affinity DataIC50: >200nM. Assay description: The inhibitor potency of the exemplified compounds was measured in an enzyme assay that measures peptide phosphorylation using FRET measurements to d...
Ligand InfoPC cidPC sid
In DepthDetails US Patent
TargetFibroblast growth factor receptor 2(Homo sapiens (Human))
Incyte
US Patent
LigandPNGBDBM357716(N-((1-(cyanomethyl)-3-(2,6-difluoro-3,5-dimethoxyp...)
Affinity DataIC50: >200nM. Assay description: The inhibitor potency of the exemplified compounds was measured in an enzyme assay that measures peptide phosphorylation using FRET measurements to d...
Ligand InfoPC cidPC sid
In DepthDetails US Patent
TargetFibroblast growth factor receptor 3(Homo sapiens (Human))
Incyte
US Patent
LigandPNGBDBM357716(N-((1-(cyanomethyl)-3-(2,6-difluoro-3,5-dimethoxyp...)
Affinity DataIC50: >200nM. Assay description: The inhibitor potency of the exemplified compounds was measured in an enzyme assay that measures peptide phosphorylation using FRET measurements to d...
Ligand InfoPC cidPC sid
In DepthDetails US Patent
TargetFibroblast growth factor receptor 4(Homo sapiens (Human))
Incyte
US Patent
LigandPNGBDBM357716(N-((1-(cyanomethyl)-3-(2,6-difluoro-3,5-dimethoxyp...)
Affinity DataIC50: <10nM. Assay description: The inhibitor potency of the exemplified compounds was measured in an enzyme assay that measures peptide phosphorylation using FRET measurements to d...
Ligand InfoPC cidPC sid
In DepthDetails US Patent
TargetFibroblast growth factor receptor 1(Homo sapiens (Human))
Incyte
US Patent
LigandPNGBDBM357716(N-((1-(cyanomethyl)-3-(2,6-difluoro-3,5-dimethoxyp...)
Affinity DataIC50: >200nM. Assay description: The inhibitor potency of the exemplified compounds was measured in an enzyme assay that measures peptide phosphorylation using FRET measurements to d...
Ligand InfoPC cidPC sid
In DepthDetails US Patent
TargetFibroblast growth factor receptor 2(Homo sapiens (Human))
Incyte
US Patent
LigandPNGBDBM357716(N-((1-(cyanomethyl)-3-(2,6-difluoro-3,5-dimethoxyp...)
Affinity DataIC50: >200nM. Assay description: The inhibitor potency of the exemplified compounds was measured in an enzyme assay that measures peptide phosphorylation using FRET measurements to d...
Ligand InfoPC cidPC sid
In DepthDetails US Patent
TargetFibroblast growth factor receptor 3(Homo sapiens (Human))
Incyte
US Patent
LigandPNGBDBM357716(N-((1-(cyanomethyl)-3-(2,6-difluoro-3,5-dimethoxyp...)
Affinity DataIC50: >200nM. Assay description: The inhibitor potency of the exemplified compounds was measured in an enzyme assay that measures peptide phosphorylation using FRET measurements to d...
Ligand InfoPC cidPC sid
In DepthDetails US Patent
TargetFibroblast growth factor receptor 4(Homo sapiens (Human))
Incyte
US Patent
LigandPNGBDBM357716(N-((1-(cyanomethyl)-3-(2,6-difluoro-3,5-dimethoxyp...)
Affinity DataIC50: <10nM. Assay description: The inhibitor potency of the exemplified compounds was measured in an enzyme assay that measures peptide phosphorylation using FRET measurements to d...
Ligand InfoPC cidPC sid
In DepthDetails US Patent
TargetFibroblast growth factor receptor 1(Homo sapiens (Human))
Incyte
US Patent
LigandPNGBDBM357716(N-((1-(cyanomethyl)-3-(2,6-difluoro-3,5-dimethoxyp...)
Affinity DataIC50: >200nM. Assay description: The inhibitor potency of the exemplified compounds was measured in an enzyme assay that measures peptide phosphorylation using FRET measurements to d...
Ligand InfoPC cidPC sid
In DepthDetails US Patent
TargetFibroblast growth factor receptor 2(Homo sapiens (Human))
Incyte
US Patent
LigandPNGBDBM357716(N-((1-(cyanomethyl)-3-(2,6-difluoro-3,5-dimethoxyp...)
Affinity DataIC50: >200nM. Assay description: The inhibitor potency of the exemplified compounds was measured in an enzyme assay that measures peptide phosphorylation using FRET measurements to d...
Ligand InfoPC cidPC sid
In DepthDetails US Patent
TargetFibroblast growth factor receptor 3(Homo sapiens (Human))
Incyte
US Patent
LigandPNGBDBM357716(N-((1-(cyanomethyl)-3-(2,6-difluoro-3,5-dimethoxyp...)
Affinity DataIC50: >200nM. Assay description: The inhibitor potency of the exemplified compounds was measured in an enzyme assay that measures peptide phosphorylation using FRET measurements to d...
Ligand InfoPC cidPC sid
In DepthDetails US Patent
TargetFibroblast growth factor receptor 2(Homo sapiens (Human))
Incyte
US Patent
LigandPNGBDBM357716(N-((1-(cyanomethyl)-3-(2,6-difluoro-3,5-dimethoxyp...)
Affinity DataIC50: >200nM. Assay description: TBD
Ligand InfoPC cidPC sid
In DepthDetails US Patent