BDBM35887 flufenamic acid analogue, 14
SMILES OC(=O)c1ccccc1Nc1ccc(Oc2ccc(cc2)[N+]([O-])=O)cc1
InChI Key InChIKey=PAIOJHHKIKYJJX-UHFFFAOYSA-N
Data  1 IC50  1 EC50
  Tab Delimited (TSV)   2D SDfile   Computed 3D by Vconf -m prep SDfile
Find this compound or compounds like it in BindingDB:
Activity Spreadsheet -- Enzyme Inhibition Constant Data from BindingDB
Found 1 hit for monomerid = 35887
TargetAndrogen receptor(Homo sapiens (Human))
St. Jude Research Hospital
LigandPNGBDBM35887(flufenamic acid analogue, 14)
Affinity DataIC50:  2.80E+3nM EC50:  5.65E+4nMpH: 7.2 T: 2°C. Assay description: A radiolabeled ligand competition scintillation proximity assay (SPA) for the androgen receptor (AR) using Ni-coated 384-well FlashPlates. It measure...
In DepthDetails ArticlePubMed