BDBM3615 4-[(Phenylmethyl)amino]-pyrido[3,2-d]pyrimidine::CHEMBL53552::N-benzylpyrido[3,2-d]pyrimidin-4-amine::Pyrido[3,2-d]pyrimidine 10a
SMILES C(Nc1ncnc2cccnc12)c1ccccc1
InChI Key InChIKey=WALLIFXHVLZYJG-UHFFFAOYSA-N
Data  1 IC50
  Tab Delimited (TSV)   2D SDfile   Computed 3D by Vconf -m prep SDfile
Find this compound or compounds like it in BindingDB:
Activity Spreadsheet -- Enzyme Inhibition Constant Data from BindingDB
Found 1 hit for monomerid = 3615
TargetEpidermal growth factor receptor(Homo sapiens (Human))
University Of Auckland
LigandPNGBDBM3615(4-[(Phenylmethyl)amino]-pyrido[3,2-d]pyrimidine | ...)
Affinity DataIC50:  603nM. Assay description: IC50 is the inhibitor concentration which inhibits 50% of kinase activity that catalyzes the transfer of the terminal phosphate from [gamma-32P] labe...
In DepthDetails ArticlePubMed