BDBM36461 3-Benzyl-4-(3-(cyclohexylmethyl)-4-methoxybenzamido)benzoic acid, 3::CID42628633
SMILES COc1ccc(cc1CC1CCCCC1)C(=O)Nc1ccc(cc1Cc1ccccc1)C(O)=O
InChI Key InChIKey=ZDRJDFICBFPYHL-UHFFFAOYSA-N
Data  1 IC50
  Tab Delimited (TSV)   2D SDfile   Computed 3D by Vconf -m prep SDfile
Find this compound or compounds like it in BindingDB:
Activity Spreadsheet -- Enzyme Inhibition Constant Data from BindingDB
Found 1 hit for monomerid = 36461
TargetKaposi's sarcoma-associated herpesvirus cyclin homolog(Human herpesvirus 8 (HHV-8) (Kaposi's sarcoma-...)
University Of California San Francisco
LigandPNGBDBM36461(3-Benzyl-4-(3-(cyclohexylmethyl)-4-methoxybenzamid...)
Affinity DataIC50:  16.4nMpH: 8.0 T: 2°C. Assay description: Human herpesvirus assay using human Kaposi's sarcoma-associated herpesvirus protease (KSHV Pr).
In DepthDetails ArticlePubMed